Spack will be used to manage open source software packages on Fugaku.
Fugaku users can easily use pre-installed packages and built packages based on Spack recipes.
The following list shows the results of building/compiling packages for aarch64 according to the Spack recipes.
Note that the results in this list do not guarantee that each package will work properly.
On the other hand, Fujitsu will provide the following packages compiled with Fujitsu compiler on Fugaku as "external" packages, of which Spack can be aware.
![]() |
Compiler | Fujitsu Compiler Fujitsu C/C++ Compiler 4.10.0 tcsds-1.2.38 |
---|---|
Result | Dependency Error |
Failed to install dependency package :
------------------------------------------------
==> Warning: config:terminal_title has been replaced by install_status and is ignored
==> Warning: Failed to initialize repository: '$spack/var/spack/repos/local'.
No repo.yaml found in '$spack/var/spack/repos/local'
To remove the bad repository, run this command:
spack repo rm $spack/var/spack/repos/local
[+] /usr (external gmake-4.2.1-eszqmok6vi6wxcmklx6bqloeidbh25kb)
[+] /vol0003/rccs-sdt/data/a01008/spack-all-test/env-20240227/spack/opt/spack/linux-rhel8-a64fx/fj-4.10.0/gnuconfig-2022-09-17-w33oejhx46ex2iql4orzjqdmt2kdqdb2
==> Installing baurmc-1.0-7ekbah7junhpevdjdxwh6ma5ek3qfd42 [3/3]
==> No binary for baurmc-1.0-7ekbah7junhpevdjdxwh6ma5ek3qfd42 found: installing from source
==> Fetching https://spack-llnl-mirror.s3-us-west-2.amazonaws.com/_source-cache/archive/de/de5027ed2e66028bed890760bee9d869e1e330ac7f7112ee5cb25868cea5c35b.tgz
==> Ran patch() for baurmc
==> baurmc: Executing phase: 'autoreconf'
==> baurmc: Executing phase: 'configure'
==> baurmc: Executing phase: 'build'
==> Error: ProcessError: Command exited with status 2:
'make' '-j16' 'V=1'
5 errors found in build log:
20 ==> baurmc: Executing phase: 'build'
21 ==> [2024-03-10-12:13:18.576929] 'make' '-j16' 'V=1'
22 make[1]: Entering directory '/vol0003/rccs-sdt/data/a01008/tmpdir/sp
ack-stage/spack-stage-baurmc-1.0-7ekbah7junhpevdjdxwh6ma5ek3qfd42/sp
ack-src/1.0'
23 compilation for the archive library lib/archive/libwgamma.a
24 gfortran -O2 -Wuninitialized -ffast-math -fno-automatic -fallow-argu
ment-mismatch -c -I. wgamma/wgamma_outp.f -o tmp/archive/wgamma_out
p.o
25 gfortran -O2 -Wuninitialized -ffast-math -fno-automatic -fallow-argu
ment-mismatch -c -I. wgamma/wgamma.f -o tmp/archive/wgamma.o
>> 26 gfortran: error: unrecognized command line option '-fallow-argument-
mismatch'; did you mean '-Wno-argument-mismatch'?
>> 27 gfortran: error: unrecognized command line option '-fallow-argument-
mismatch'; did you mean '-Wno-argument-mismatch'?
>> 28 make[1]: *** [Makearchive.subdir:18: tmp/archive/wgamma_outp.o] Erro
r 1
29 make[1]: *** Waiting for unfinished jobs....
>> 30 make[1]: *** [Makearchive.subdir:18: tmp/archive/wgamma.o] Error 1
31 make[1]: Leaving directory '/vol0003/rccs-sdt/data/a01008/tmpdir/spa
ck-stage/spack-stage-baurmc-1.0-7ekbah7junhpevdjdxwh6ma5ek3qfd42/spa
ck-src/1.0'
>> 32 make: *** [Makefile:52: libs] Error 2
See build log for details:
/data/rccs-sdt/a01008/tmpdir/spack-stage/spack-stage-baurmc-1.0-7ekbah7junhpevdjdxwh6ma5ek3qfd42/spack-build-out.txt