List of Open Source Software which can be built on Fugaku

Spack logo
Spack will be used to manage open source software packages on Fugaku. Fugaku users can easily use pre-installed packages and built packages based on Spack recipes. The following list shows the results of building/compiling packages for aarch64 according to the Spack recipes. Note that the results in this list do not guarantee that each package will work properly. On the other hand, Fujitsu will provide the following packages compiled with Fujitsu compiler on Fugaku as "external" packages, of which Spack can be aware.
  • OpenJDK 11
  • Ruby 2.6.5 or later
  • Python2 2.7.15
  • Python3 3.6.8
  • Numpy 1.14.3
  • SciPy 1.0.0
  • Eclipse IDE 2019-09 R Packages
Please contact us from email:

blitz 1.0.2

Compiler Fujitsu Compiler Fujitsu C/C++ Compiler 4.10.0 tcsds-1.2.38
Result Dependency Error

Failed Reason

Failed to install dependency package :
------------------------------------------------
==> Warning: config:terminal_title has been replaced by install_status and is ignored
==> Warning: Failed to initialize repository: '$spack/var/spack/repos/local'.
No repo.yaml found in '$spack/var/spack/repos/local'
To remove the bad repository, run this command:
spack repo rm $spack/var/spack/repos/local
[+] /usr (external gmake-4.2.1-eszqmok6vi6wxcmklx6bqloeidbh25kb)
[+] /vol0003/rccs-sdt/data/a01008/spack-all-test/env-20240227/spack/opt/spack/linux-rhel8-a64fx/fj-4.10.0/gnuconfig-2022-09-17-w33oejhx46ex2iql4orzjqdmt2kdqdb2
[+] /vol0004/apps/oss/spack-v0.19/opt/spack/linux-rhel8-a64fx/fj-4.8.1/python-3.10.8-7q66snjvhvy7im57hncbgpirmddrb5sk (external python-3.10.8-zcbuy6dnhwhmsrco46b6ayaywy4nrfcy)
==> Installing blitz-1.0.2-egy5b33yan3xqykwnnjhsj5fg4ddapfs [4/4]
==> No binary for blitz-1.0.2-egy5b33yan3xqykwnnjhsj5fg4ddapfs found: installing from source
==> Fetching https://spack-llnl-mirror.s3-us-west-2.amazonaws.com/_source-cache/archive/50/500db9c3b2617e1f03d0e548977aec10d36811ba1c43bb5ef250c0e3853ae1c2.tar.gz
==> No patches needed for blitz
==> blitz: Executing phase: 'autoreconf'
==> blitz: Executing phase: 'configure'
==> blitz: Executing phase: 'build'
==> Error: ProcessError: Command exited with status 2:
'make' '-j16' 'V=1' 'lib'

4 errors found in build log:
360 make[3]: Leaving directory '/vol0003/rccs-sdt/data/a01008/tmpdir/sp
ack-stage/spack-stage-blitz-1.0.2-egy5b33yan3xqykwnnjhsj5fg4ddapfs/
spack-src/blitz/meta'
361 Making all in array
362 make[3]: Entering directory '/vol0003/rccs-sdt/data/a01008/tmpdir/s
pack-stage/spack-stage-blitz-1.0.2-egy5b33yan3xqykwnnjhsj5fg4ddapfs
/spack-src/blitz/array'
363 make[3]: Nothing to be done for 'all'.
364 make[3]: Leaving directory '/vol0003/rccs-sdt/data/a01008/tmpdir/sp
ack-stage/spack-stage-blitz-1.0.2-egy5b33yan3xqykwnnjhsj5fg4ddapfs/
spack-src/blitz/array'
365 make[3]: Entering directory '/vol0003/rccs-sdt/data/a01008/tmpdir/s
pack-stage/spack-stage-blitz-1.0.2-egy5b33yan3xqykwnnjhsj5fg4ddapfs
/spack-src/blitz'
>> 366 make[3]: *** No rule to make target '/bzconfig.h', needed by 'all-a
m'. Stop.
367 make[3]: Leaving directory '/vol0003/rccs-sdt/data/a01008/tmpdir/sp
ack-stage/spack-stage-blitz-1.0.2-egy5b33yan3xqykwnnjhsj5fg4ddapfs/
spack-src/blitz'
>> 368 make[2]: *** [Makefile:583: all-recursive] Error 1
369 make[2]: Leaving directory '/vol0003/rccs-sdt/data/a01008/tmpdir/sp
ack-stage/spack-stage-blitz-1.0.2-egy5b33yan3xqykwnnjhsj5fg4ddapfs/
spack-src/blitz'
>> 370 make[1]: *** [Makefile:477: all] Error 2
371 make[1]: Leaving directory '/vol0003/rccs-sdt/data/a01008/tmpdir/sp
ack-stage/spack-stage-blitz-1.0.2-egy5b33yan3xqykwnnjhsj5fg4ddapfs/
spack-src/blitz'
>> 372 make: *** [Makefile:984: blitz-library] Error 1

See build log for details:
/data/rccs-sdt/a01008/tmpdir/spack-stage/spack-stage-blitz-1.0.2-egy5b33yan3xqykwnnjhsj5fg4ddapfs/spack-build-out.txt


<= Back to list