List of Open Source Software which can be built on Fugaku

Spack logo
Spack will be used to manage open source software packages on Fugaku. Fugaku users can easily use pre-installed packages and built packages based on Spack recipes. The following list shows the results of building/compiling packages for aarch64 according to the Spack recipes. Note that the results in this list do not guarantee that each package will work properly. On the other hand, Fujitsu will provide the following packages compiled with Fujitsu compiler on Fugaku as "external" packages, of which Spack can be aware.
  • OpenJDK 11
  • Ruby 2.6.5 or later
  • Python2 2.7.15
  • Python3 3.6.8
  • Numpy 1.14.3
  • SciPy 1.0.0
  • Eclipse IDE 2019-09 R Packages
Please contact us from email:

bowtie2 2.5.1

Compiler Fujitsu Compiler Fujitsu C/C++ Compiler 4.10.0 tcsds-1.2.38
Result Dependency Error

Failed Reason

Failed to install dependency package :
------------------------------------------------
76 ^ ~~~~~~~~~
77 /opt/FJSVxtclanga/tcsds-1.2.38/clang-comp/lib64/clang/7.1.0/include
/arm_sve.h:8086:50: note: expanded from macro 'svld1_s32'
78 __attribute__((unused)) int32_t const * __s1 = __p1; \
79 ^~~~
80 In file included from ../spack-src/test/x86/avx512/4dpwssd.c:4:
81 In file included from ../spack-src/simde/x86/avx512/4dpwssd.h:8:
>> 82 ../spack-src/test/x86/avx512/../../../simde/x86/avx512/add.h:412:30
: error: address of vector element requested
83 vb = svld1_s32(pg, &(b_.i32[i]));
84 ^ ~~~~~~~~~
85 /opt/FJSVxtclanga/tcsds-1.2.38/clang-comp/lib64/clang/7.1.0/include
/arm_sve.h:8088:41: note: expanded from macro 'svld1_s32'
86 __ret = __builtin_sve_svld1_s32(__s0, __p1); \
87 ^~~~
88 In file included from ../spack-src/test/x86/avx512/4dpwssd.c:4:
89 In file included from ../spack-src/simde/x86/avx512/4dpwssd.h:8:
>> 90 ../spack-src/test/x86/avx512/../../../simde/x86/avx512/add.h:413:23
: error: address of vector element requested
91 svst1_s32(pg, &(r_.i32[i]), svadd_s32_x(pg, va, vb));
92 ^ ~~~~~~~~~
93 /opt/FJSVxtclanga/tcsds-1.2.38/clang-comp/lib64/clang/7.1.0/include
/arm_sve.h:20260:44: note: expanded from macro 'svst1_s32'
94 __attribute__((unused)) int32_t * __s1 = __p1; \
95 ^~~~
96 In file included from ../spack-src/test/x86/avx512/4dpwssd.c:4:
97 In file included from ../spack-src/simde/x86/avx512/4dpwssd.h:8:
>> 98 ../spack-src/test/x86/avx512/../../../simde/x86/avx512/add.h:413:23
: error: address of vector element requested
99 svst1_s32(pg, &(r_.i32[i]), svadd_s32_x(pg, va, vb));
100 ^ ~~~~~~~~~
101 /opt/FJSVxtclanga/tcsds-1.2.38/clang-comp/lib64/clang/7.1.0/include
/arm_sve.h:20262:33: note: expanded from macro 'svst1_s32'
102 __builtin_sve_svst1_s32(__s0, __p1, __s2); \
103 ^~~~
104 1 warning and 6 errors generated.

...

121 [13/3100] /vol0003/rccs-sdt/data/a01008/spack-all-test/env-20240227
/spack/lib/spack/env/fj/case-insensitive/FCC -Itest/common/common-c
pp.p -Itest/common -I../spack-src/test/common -I. -I../spack-src -f
color-diagnostics -D_FILE_OFFSET_BITS=64 -Wall -Winvalid-pch -O3 -f
openmp-simd -DSIMDE_CONSTRAINED_COMPILATION -DSIMDE_ENABLE_OPENMP -
Wno-psabi -DSIMDE_TEST_BARE -MD -MQ test/common/common-cpp.p/meson-
generated_.._common.cpp.o -MF test/common/common-cpp.p/meson-genera
ted_.._common.cpp.o.d -o test/common/common-cpp.p/meson-generated_.
._common.cpp.o -c test/common/common.cpp
122 warning: unknown warning option '-Wno-psabi' [-Wunknown-warning-opt
ion]
123 1 warning generated.
124 [14/3100] /vol0003/rccs-sdt/data/a01008/spack-all-test/env-20240227
/spack/lib/spack/env/fj/fcc -o test/x86/avx512/2intersect-emul-c t
est/x86/avx512/2intersect-emul-c.p/2intersect.c.o -Wl,--as-needed -
Wl,--no-undefined -Wl,-O1 -Wl,--start-group -lm -Wl,--end-group
125 [15/3100] /vol0003/rccs-sdt/data/a01008/spack-all-test/env-20240227
/spack/lib/spack/env/fj/fcc -o test/x86/avx512/4dpwssds-emul-c tes
t/x86/avx512/4dpwssds-emul-c.p/4dpwssds.c.o -Wl,--as-needed -Wl,--n
o-undefined -Wl,-O1 -Wl,--start-group -lm -Wl,--end-group
126 [16/3100] /vol0003/rccs-sdt/data/a01008/spack-all-test/env-20240227
/spack/lib/spack/env/fj/case-insensitive/FCC -Itest/x86/avx512/4dpw
ssd-native-cpp.p -Itest/x86/avx512 -I../spack-src/test/x86/avx512 -
I. -I../spack-src -fcolor-diagnostics -D_FILE_OFFSET_BITS=64 -Wall
-Winvalid-pch -O3 -fopenmp-simd -DSIMDE_CONSTRAINED_COMPILATION -DS
IMDE_ENABLE_OPENMP -Wno-psabi -DSIMDE_TEST_BARE -MD -MQ test/x86/av
x512/4dpwssd-native-cpp.p/meson-generated_.._4dpwssd.cpp.o -MF test
/x86/avx512/4dpwssd-native-cpp.p/meson-generated_.._4dpwssd.cpp.o.d
-o test/x86/avx512/4dpwssd-native-cpp.p/meson-generated_.._4dpwssd
.cpp.o -c test/x86/avx512/4dpwssd.cpp
>> 127 FAILED: test/x86/avx512/4dpwssd-native-cpp.p/meson-generated_.._4dp
wssd.cpp.o
128 /vol0003/rccs-sdt/data/a01008/spack-all-test/env-20240227/spack/lib
/spack/env/fj/case-insensitive/FCC -Itest/x86/avx512/4dpwssd-native
-cpp.p -Itest/x86/avx512 -I../spack-src/test/x86/avx512 -I. -I../sp
ack-src -fcolor-diagnostics -D_FILE_OFFSET_BITS=64 -Wall -Winvalid-
pch -O3 -fopenmp-simd -DSIMDE_CONSTRAINED_COMPILATION -DSIMDE_ENABL
E_OPENMP -Wno-psabi -DSIMDE_TEST_BARE -MD -MQ test/x86/avx512/4dpws
sd-native-cpp.p/meson-generated_.._4dpwssd.cpp.o -MF test/x86/avx51
2/4dpwssd-native-cpp.p/meson-generated_.._4dpwssd.cpp.o.d -o test/x
86/avx512/4dpwssd-native-cpp.p/meson-generated_.._4dpwssd.cpp.o -c
test/x86/avx512/4dpwssd.cpp
129 warning: unknown warning option '-Wno-psabi' [-Wunknown-warning-opt
ion]
130 In file included from test/x86/avx512/4dpwssd.cpp:4:
131 In file included from ../spack-src/simde/x86/avx512/4dpwssd.h:8:
>> 132 ../spack-src/test/x86/avx512/../../../simde/x86/avx512/add.h:411:30
: error: address of vector element requested
133 va = svld1_s32(pg, &(a_.i32[i])),
134 ^ ~~~~~~~~~
135 /opt/FJSVxtclanga/tcsds-1.2.38/clang-comp/lib64/clang/7.1.0/include
/arm_sve.h:8086:50: note: expanded from macro 'svld1_s32'
136 __attribute__((unused)) int32_t const * __s1 = __p1; \
137 ^~~~
138 In file included from test/x86/avx512/4dpwssd.cpp:4:
139 In file included from ../spack-src/simde/x86/avx512/4dpwssd.h:8:
>> 140 ../spack-src/test/x86/avx512/../../../simde/x86/avx512/add.h:411:30
: error: address of vector element requested
141 va = svld1_s32(pg, &(a_.i32[i])),
142 ^ ~~~~~~~~~
143 /opt/FJSVxtclanga/tcsds-1.2.38/clang-comp/lib64/clang/7.1.0/include
/arm_sve.h:8088:41: note: expanded from macro 'svld1_s32'
144 __ret = __builtin_sve_svld1_s32(__s0, __p1); \
145 ^~~~
146 In file included from test/x86/avx512/4dpwssd.cpp:4:
147 In file included from ../spack-src/simde/x86/avx512/4dpwssd.h:8:
>> 148 ../spack-src/test/x86/avx512/../../../simde/x86/avx512/add.h:412:30
: error: address of vector element requested
149 vb = svld1_s32(pg, &(b_.i32[i]));
150 ^ ~~~~~~~~~
151 /opt/FJSVxtclanga/tcsds-1.2.38/clang-comp/lib64/clang/7.1.0/include
/arm_sve.h:8086:50: note: expanded from macro 'svld1_s32'
152 __attribute__((unused)) int32_t const * __s1 = __p1; \
153 ^~~~
154 In file included from test/x86/avx512/4dpwssd.cpp:4:
155 In file included from ../spack-src/simde/x86/avx512/4dpwssd.h:8:
>> 156 ../spack-src/test/x86/avx512/../../../simde/x86/avx512/add.h:412:30
: error: address of vector element requested
157 vb = svld1_s32(pg, &(b_.i32[i]));
158 ^ ~~~~~~~~~
159 /opt/FJSVxtclanga/tcsds-1.2.38/clang-comp/lib64/clang/7.1.0/include
/arm_sve.h:8088:41: note: expanded from macro 'svld1_s32'
160 __ret = __builtin_sve_svld1_s32(__s0, __p1); \
161 ^~~~
162 In file included from test/x86/avx512/4dpwssd.cpp:4:
163 In file included from ../spack-src/simde/x86/avx512/4dpwssd.h:8:
>> 164 ../spack-src/test/x86/avx512/../../../simde/x86/avx512/add.h:413:23
: error: address of vector element requested
165 svst1_s32(pg, &(r_.i32[i]), svadd_s32_x(pg, va, vb));
166 ^ ~~~~~~~~~
167 /opt/FJSVxtclanga/tcsds-1.2.38/clang-comp/lib64/clang/7.1.0/include
/arm_sve.h:20260:44: note: expanded from macro 'svst1_s32'
168 __attribute__((unused)) int32_t * __s1 = __p1; \
169 ^~~~
170 In file included from test/x86/avx512/4dpwssd.cpp:4:
171 In file included from ../spack-src/simde/x86/avx512/4dpwssd.h:8:
>> 172 ../spack-src/test/x86/avx512/../../../simde/x86/avx512/add.h:413:23
: error: address of vector element requested
173 svst1_s32(pg, &(r_.i32[i]), svadd_s32_x(pg, va, vb));
174 ^ ~~~~~~~~~
175 /opt/FJSVxtclanga/tcsds-1.2.38/clang-comp/lib64/clang/7.1.0/include
/arm_sve.h:20262:33: note: expanded from macro 'svst1_s32'
176 __builtin_sve_svst1_s32(__s0, __p1, __s2); \
177 ^~~~
178 1 warning and 6 errors generated.

See build log for details:
/data/rccs-sdt/a01008/tmpdir/spack-stage/spack-stage-simde-0.7.6-3gj3y6shf4tfswtzju7izc6ymmnsgaga/spack-build-out.txt

==> Error: bowtie2-2.5.1-nqgsysadivjkrmyeyoh5a5nydayrlhsx: Package was not installed
==> Error: Installation request failed. Refer to reported errors for failing package(s).


<= Back to list