List of Open Source Software which can be built on Fugaku

Spack logo
Spack will be used to manage open source software packages on Fugaku. Fugaku users can easily use pre-installed packages and built packages based on Spack recipes. The following list shows the results of building/compiling packages for aarch64 according to the Spack recipes. Note that the results in this list do not guarantee that each package will work properly. On the other hand, Fujitsu will provide the following packages compiled with Fujitsu compiler on Fugaku as "external" packages, of which Spack can be aware.
  • OpenJDK 11
  • Ruby 2.6.5 or later
  • Python2 2.7.15
  • Python3 3.6.8
  • Numpy 1.14.3
  • SciPy 1.0.0
  • Eclipse IDE 2019-09 R Packages
Please contact us from email:

bricks 2023.08.25

Compiler Fujitsu Compiler Fujitsu C/C++ Compiler 4.10.0 tcsds-1.2.38
Result Dependency Error

Failed Reason

Failed to install dependency package :
------------------------------------------------
>> 415 VSBrick-mpi7pt.py-ASIMD-8x8x8-2:235:15: error: unknown type name 'u
int32x4_t'
416 uint32x4_t _cg_vectmp0;
417 ^
>> 418 VSBrick-mpi7pt.py-ASIMD-8x8x8-2:106:38: error: use of undeclared id
entifier 'vld1q_u32'
419 _cg_in000_vecbuf = vld1q_u32((uint32_t *) & in.da
t[neighbor4 * in.step + 450 + rel]);
420 ^
>> 421 VSBrick-mpi7pt.py-ASIMD-8x8x8-2:270:30: error: use of undeclared id
entifier 'vld1q_u32'
422 _cg_in000_vecbuf = vld1q_u32((uint32_t *) & in.dat[neighb
or14 * in.step]);
423 ^
>> 424 VSBrick-mpi7pt.py-ASIMD-8x8x8-2:271:11: error: unknown type name 'u
int32x4_t'
425 uint32x4_t _cg_vectmp0;
426 ^
>> 427 VSBrick-mpi7pt.py-ASIMD-8x8x8-2:126:30: error: use of undeclared id
entifier 'vld1q_u32'
428 _cg_in000_vecbuf = vld1q_u32((uint32_t *) & in.dat[neighb
or10 * in.step + 56]);
429 ^
>> 430 VSBrick-mpi7pt.py-ASIMD-8x8x8-2:292:35: error: use of undeclared id
entifier 'vld1q_u32'
431 _cg_in_100_vecbuf = vld1q_u32((uint32_t *) & in.dat[n
eighbor12 * in.step + 14 + rel]);
432 ^
>> 433 VSBrick-mpi7pt.py-ASIMD-8x8x8-2:145:34: error: use of undeclared id
entifier 'vld1q_u32'
434 _cg_in000_vecbuf = vld1q_u32((uint32_t *) & in.dat[ne
ighbor10 * in.step + 58 + rel]);
435 ^
>> 436 VSBrick-mpi7pt.py-ASIMD-8x8x8-2:294:34: error: use of undeclared id
entifier 'vld1q_u32'
437 _cg_in000_vecbuf = vld1q_u32((uint32_t *) & in.dat[ne
ighbor13 * in.step + 8 + rel]);
438 ^
>> 439 VSBrick-mpi7pt.py-ASIMD-8x8x8-2:162:31: error: use of undeclared id
entifier 'vld1q_u32'
440 _cg_in_100_vecbuf = vld1q_u32((uint32_t *) & in.dat[neigh
bor12 * in.step + 6]);
441 ^
>> 442 VSBrick-mpi7pt.py-ASIMD-8x8x8-2:271:11: error: unknown type name 'u
int32x4_t'
443 uint32x4_t _cg_vectmp0;
444 ^
>> 445 VSBrick-mpi7pt.py-ASIMD-8x8x8-2:164:30: error: use of undeclared id
entifier 'vld1q_u32'
446 _cg_in000_vecbuf = vld1q_u32((uint32_t *) & in.dat[neighb
or13 * in.step]);
447 ^
>> 448 VSBrick-mpi7pt.py-ASIMD-8x8x8-2:292:35: error: use of undeclared id
entifier 'vld1q_u32'
449 _cg_in_100_vecbuf = vld1q_u32((uint32_t *) & in.dat[n
eighbor12 * in.step + 14 + rel]);
450 ^
>> 451 VSBrick-mpi7pt.py-ASIMD-8x8x8-2:294:34: error: use of undeclared id
entifier 'vld1q_u32'
452 _cg_in000_vecbuf = vld1q_u32((uint32_t *) & in.dat[ne
ighbor13 * in.step + 8 + rel]);
453 ^
>> 454 VSBrick-mpi7pt.py-ASIMD-8x8x8-2:295:15: error: unknown type name 'u
int32x4_t'
455 uint32x4_t _cg_vectmp0;
456 ^
457 fatal error: too many errors emitted, stopping now [-ferror-limit=]
>> 458 VSBrick-mpi7pt.py-ASIMD-8x8x8-2:165:11: error: unknown type name 'u
int32x4_t'
459 uint32x4_t _cg_vectmp0;
460 ^
>> 461 VSBrick-mpi7pt.py-ASIMD-8x8x8-2:196:30: error: use of undeclared id
entifier 'vld1q_u32'
462 _cg_in000_vecbuf = vld1q_u32((uint32_t *) & in.dat[neighb
or13 * in.step + 2]);
463 ^
>> 464 VSBrick-mpi7pt.py-ASIMD-8x8x8-2:295:15: error: unknown type name 'u
int32x4_t'
465 uint32x4_t _cg_vectmp0;
466 ^
467 fatal error: too many errors emitted, stopping now [-ferror-limit=]
>> 468 VSBrick-mpi7pt.py-ASIMD-8x8x8-2:197:11: error: unknown type name 'u
int32x4_t'
469 uint32x4_t _cg_vectmp0;
470 ^
>> 471 VSBrick-mpi7pt.py-ASIMD-8x8x8-2:234:34: error: use of undeclared id
entifier 'vld1q_u32'
472 _cg_in000_vecbuf = vld1q_u32((uint32_t *) & in.dat[ne
ighbor13 * in.step + 4 + rel]);
473 ^
>> 474 VSBrick-mpi7pt.py-ASIMD-8x8x8-2:235:15: error: unknown type name 'u
int32x4_t'
475 uint32x4_t _cg_vectmp0;
476 ^
>> 477 VSBrick-mpi7pt.py-ASIMD-8x8x8-2:270:30: error: use of undeclared id
entifier 'vld1q_u32'
478 _cg_in000_vecbuf = vld1q_u32((uint32_t *) & in.dat[neighb
or14 * in.step]);
479 ^
480 20 errors generated.
481 20 errors generated.
>> 482 make[2]: *** [weak/CMakeFiles/weak-cpu.dir/build.make:83: weak/CMak
eFiles/weak-cpu.dir/main-out.cpp.o] Error 1
483 make[2]: Leaving directory '/vol0003/rccs-sdt/data/a01008/tmpdir/sp
ack-stage/spack-stage-bricks-2023.08.25-on7bzvk5aps4jgpn3ry6usapmlj
3jirm/spack-build-on7bzvk'
>> 484 make[1]: *** [CMakeFiles/Makefile2:299: weak/CMakeFiles/weak-cpu.di
r/all] Error 2
>> 485 VSBrick-mpi7pt.py-ASIMD-8x8x8-2:271:11: error: unknown type name 'u
int32x4_t'
486 uint32x4_t _cg_vectmp0;
487 ^
>> 488 make[2]: *** [weak/CMakeFiles/weak-onesided.dir/build.make:83: weak
/CMakeFiles/weak-onesided.dir/onesided-out.cpp.o] Error 1
489 make[2]: Leaving directory '/vol0003/rccs-sdt/data/a01008/tmpdir/sp
ack-stage/spack-stage-bricks-2023.08.25-on7bzvk5aps4jgpn3ry6usapmlj
3jirm/spack-build-on7bzvk'
>> 490 make[1]: *** [CMakeFiles/Makefile2:355: weak/CMakeFiles/weak-onesid
ed.dir/all] Error 2
>> 491 VSBrick-mpi7pt.py-ASIMD-8x8x8-2:292:35: error: use of undeclared id
entifier 'vld1q_u32'
492 _cg_in_100_vecbuf = vld1q_u32((uint32_t *) & in.dat[n
eighbor12 * in.step + 14 + rel]);
493 ^
>> 494 VSBrick-mpi7pt.py-ASIMD-8x8x8-2:294:34: error: use of undeclared id
entifier 'vld1q_u32'
495 _cg_in000_vecbuf = vld1q_u32((uint32_t *) & in.dat[ne
ighbor13 * in.step + 8 + rel]);
496 ^
>> 497 VSBrick-mpi7pt.py-ASIMD-8x8x8-2:295:15: error: unknown type name 'u
int32x4_t'
498 uint32x4_t _cg_vectmp0;
499 ^
500 fatal error: too many errors emitted, stopping now [-ferror-limit=]
501 20 errors generated.
>> 502 make[2]: *** [strong/CMakeFiles/strong-cpu.dir/build.make:83: stron
g/CMakeFiles/strong-cpu.dir/main-out.cpp.o] Error 1
503 make[2]: Leaving directory '/vol0003/rccs-sdt/data/a01008/tmpdir/sp
ack-stage/spack-stage-bricks-2023.08.25-on7bzvk5aps4jgpn3ry6usapmlj
3jirm/spack-build-on7bzvk'
>> 504 make[1]: *** [CMakeFiles/Makefile2:411: strong/CMakeFiles/strong-cp
u.dir/all] Error 2
505 make[1]: Leaving directory '/vol0003/rccs-sdt/data/a01008/tmpdir/sp
ack-stage/spack-stage-bricks-2023.08.25-on7bzvk5aps4jgpn3ry6usapmlj
3jirm/spack-build-on7bzvk'
>> 506 make: *** [Makefile:139: all] Error 2

See build log for details:
/data/rccs-sdt/a01008/tmpdir/spack-stage/spack-stage-bricks-2023.08.25-on7bzvk5aps4jgpn3ry6usapmlj3jirm/spack-build-out.txt


<= Back to list