Spack will be used to manage open source software packages on Fugaku.
Fugaku users can easily use pre-installed packages and built packages based on Spack recipes.
The following list shows the results of building/compiling packages for aarch64 according to the Spack recipes.
Note that the results in this list do not guarantee that each package will work properly.
On the other hand, Fujitsu will provide the following packages compiled with Fujitsu compiler on Fugaku as "external" packages, of which Spack can be aware.
![]() |
Compiler | Fujitsu Compiler Fujitsu C/C++ Compiler 4.10.0 tcsds-1.2.38 |
---|---|
Result | Dependency Error |
Failed to install dependency package :
------------------------------------------------
see invocation)
>> 1427 make[2]: *** [internal/ceres/CMakeFiles/compressed_row_sparse_matr
ix_test.dir/build.make:108: bin/compressed_row_sparse_matrix_test]
Error 1
1428 make[2]: Leaving directory '/vol0003/rccs-sdt/data/a01008/tmpdir/s
pack-stage/spack-stage-ceres-solver-2.2.0-j7udtyrqahn63jds37xrnprk
z5naicgb/spack-build-j7udtyr'
>> 1429 make[1]: *** [CMakeFiles/Makefile2:1042: internal/ceres/CMakeFiles
/compressed_row_sparse_matrix_test.dir/all] Error 2
1430 [ 40%] Linking CXX executable ../../bin/autodiff_manifold_test
1431 cd /vol0003/rccs-sdt/data/a01008/tmpdir/spack-stage/spack-stage-ce
res-solver-2.2.0-j7udtyrqahn63jds37xrnprkz5naicgb/spack-build-j7ud
tyr/internal/ceres && /vol0003/rccs-sdt/data/a01008/spack-all-test
/env-20240227/spack/opt/spack/linux-rhel8-a64fx/fj-4.10.0/cmake-3.
27.7-ussgjuqkqbxi5dcv7kbp6bugdcjc5ph6/bin/cmake -E cmake_link_scri
pt CMakeFiles/autodiff_manifold_test.dir/link.txt --verbose=1
1432 /vol0003/rccs-sdt/data/a01008/spack-all-test/env-20240227/spack/li
b/spack/env/fj/case-insensitive/FCC -Wmissing-declarations -Wno-
unknown-pragmas -Wno-sign-compare -Wno-unused-parameter -Wno-missi
ng-field-initializers -Qunused-arguments -mllvm -inline-threshold=
600 -Wno-return-type-c-linkage -O3 -DNDEBUG CMakeFiles/autodiff_ma
nifold_test.dir/autodiff_manifold_test.cc.o -o ../../bin/autodiff_
manifold_test -Wl,-rpath,/vol0003/rccs-sdt/data/a01008/tmpdir/spa
ck-stage/spack-stage-ceres-solver-2.2.0-j7udtyrqahn63jds37xrnprkz5
naicgb/spack-build-j7udtyr/lib:/vol0003/rccs-sdt/data/a01008/spack
-all-test/env-20240227/spack/opt/spack/linux-rhel8-a64fx/fj-4.10.0
/glog-0.6.0-4jvhcvztde7iw3qtbggxmnjoff564i5g/lib64:/vol0003/rccs-s
dt/data/a01008/spack-all-test/env-20240227/spack/opt/spack/linux-r
hel8-a64fx/fj-4.10.0/gflags-2.2.2-daunsd36mqandci5yemnacknianbt4a7
/lib ../../lib/libgtest.a ../../lib/libtest_util.a ../../lib/libce
res_static.a /opt/FJSVxtclanga/tcsds-ssl2-latest/lib64/libfjlapack
.so ../../lib/libgtest.a ../../lib/libceres.so.2.2.0 /vol0003/rccs
-sdt/data/a01008/spack-all-test/env-20240227/spack/opt/spack/linux
-rhel8-a64fx/fj-4.10.0/glog-0.6.0-4jvhcvztde7iw3qtbggxmnjoff564i5g
/lib64/libglog.so.0.6.0 /vol0003/rccs-sdt/data/a01008/spack-all-te
st/env-20240227/spack/opt/spack/linux-rhel8-a64fx/fj-4.10.0/gflags
-2.2.2-daunsd36mqandci5yemnacknianbt4a7/lib/libgflags.so.2.2.2
>> 1433 /opt/FJSVxtclanga/tcsds-ssl2-latest/lib64/libfjlapack.so: undefine
d reference to `omp_get_thread_num_'
>> 1434 /opt/FJSVxtclanga/tcsds-ssl2-latest/lib64/libfjlapack.so: undefine
d reference to `__jwe_ofls'
>> 1435 /opt/FJSVxtclanga/tcsds-ssl2-latest/lib64/libfjlapack.so: undefine
d reference to `__g_dscn2'
>> 1436 /opt/FJSVxtclanga/tcsds-ssl2-latest/lib64/libfjlapack.so: undefine
d reference to `__g_dlog'
>> 1437 /opt/FJSVxtclanga/tcsds-ssl2-latest/lib64/libfjlapack.so: undefine
d reference to `__g_adxi'
>> 1438 /opt/FJSVxtclanga/tcsds-ssl2-latest/lib64/libfjlapack.so: undefine
d reference to `jwe_ptnm_'
>> 1439 /opt/FJSVxtclanga/tcsds-ssl2-latest/lib64/libfjlapack.so: undefine
d reference to `__g_cexp'
>> 1440 /opt/FJSVxtclanga/tcsds-ssl2-latest/lib64/libfjlapack.so: undefine
d reference to `__g_dsin'
>> 1441 /opt/FJSVxtclanga/tcsds-ssl2-latest/lib64/libfjlapack.so: undefine
d reference to `__f_conjg'
>> 1442 /opt/FJSVxtclanga/tcsds-ssl2-latest/lib64/libfjlapack.so: undefine
d reference to `__jwe_oinf'
>> 1443 /opt/FJSVxtclanga/tcsds-ssl2-latest/lib64/libfjlapack.so: undefine
d reference to `__g_acxi'
>> 1444 /opt/FJSVxtclanga/tcsds-ssl2-latest/lib64/libfjlapack.so: undefine
d reference to `__g_cos'
>> 1445 /opt/FJSVxtclanga/tcsds-ssl2-latest/lib64/libfjlapack.so: undefine
d reference to `__jwe_xset_sccr'
>> 1446 /opt/FJSVxtclanga/tcsds-ssl2-latest/lib64/libfjlapack.so: undefine
d reference to `__f_trans'
>> 1447 /opt/FJSVxtclanga/tcsds-ssl2-latest/lib64/libfjlapack.so: undefine
d reference to `__mpc_dvtalc'
>> 1448 /opt/FJSVxtclanga/tcsds-ssl2-latest/lib64/libfjlapack.so: undefine
d reference to `__g_axxi'
>> 1449 /opt/FJSVxtclanga/tcsds-ssl2-latest/lib64/libfjlapack.so: undefine
d reference to `__jwe_isfm'
>> 1450 /opt/FJSVxtclanga/tcsds-ssl2-latest/lib64/libfjlapack.so: undefine
d reference to `__g_dlog10'
>> 1451 /opt/FJSVxtclanga/tcsds-ssl2-latest/lib64/libfjlapack.so: undefine
d reference to `__g_arxr'
>> 1452 /opt/FJSVxtclanga/tcsds-ssl2-latest/lib64/libfjlapack.so: undefine
d reference to `__f_dconjg'
>> 1453 /opt/FJSVxtclanga/tcsds-ssl2-latest/lib64/libfjlapack.so: undefine
d reference to `__f_ccomp'
>> 1454 /opt/FJSVxtclanga/tcsds-ssl2-latest/lib64/libfjlapack.so: undefine
d reference to `__f_scmov'
>> 1455 /opt/FJSVxtclanga/tcsds-ssl2-latest/lib64/libfjlapack.so: undefine
d reference to `__g_arxi'
>> 1456 /opt/FJSVxtclanga/tcsds-ssl2-latest/lib64/libfjlapack.so: undefine
d reference to `__g_adxd'
>> 1457 /opt/FJSVxtclanga/tcsds-ssl2-latest/lib64/libfjlapack.so: undefine
d reference to `__g_dcos'
>> 1458 /opt/FJSVxtclanga/tcsds-ssl2-latest/lib64/libfjlapack.so: undefine
d reference to `omp_get_num_threads_'
>> 1459 /opt/FJSVxtclanga/tcsds-ssl2-latest/lib64/libfjlapack.so: undefine
d reference to `__jwe_xdal'
>> 1460 /opt/FJSVxtclanga/tcsds-ssl2-latest/lib64/libfjlapack.so: undefine
d reference to `__g_cdexp'
>> 1461 /opt/FJSVxtclanga/tcsds-ssl2-latest/lib64/libfjlapack.so: undefine
d reference to `__mpc_dvtdal'
>> 1462 /opt/FJSVxtclanga/tcsds-ssl2-latest/lib64/libfjlapack.so: undefine
d reference to `__g_dexp'
>> 1463 /opt/FJSVxtclanga/tcsds-ssl2-latest/lib64/libfjlapack.so: undefine
d reference to `__g_log10'
>> 1464 /opt/FJSVxtclanga/tcsds-ssl2-latest/lib64/libfjlapack.so: undefine
d reference to `__g_cdsqrt'
>> 1465 /opt/FJSVxtclanga/tcsds-ssl2-latest/lib64/libfjlapack.so: undefine
d reference to `__f_ltm4'
>> 1466 /opt/FJSVxtclanga/tcsds-ssl2-latest/lib64/libfjlapack.so: undefine
d reference to `__jwe_xstp'
>> 1467 /opt/FJSVxtclanga/tcsds-ssl2-latest/lib64/libfjlapack.so: undefine
d reference to `__g_sin'
>> 1468 /opt/FJSVxtclanga/tcsds-ssl2-latest/lib64/libfjlapack.so: undefine
d reference to `__g_csqrt'
>> 1469 /opt/FJSVxtclanga/tcsds-ssl2-latest/lib64/libfjlapack.so: undefine
d reference to `__g_atan2'
>> 1470 /opt/FJSVxtclanga/tcsds-ssl2-latest/lib64/libfjlapack.so: undefine
d reference to `__f_aixi'
>> 1471 /opt/FJSVxtclanga/tcsds-ssl2-latest/lib64/libfjlapack.so: undefine
d reference to `__jwe_xalc'
>> 1472 /opt/FJSVxtclanga/tcsds-ssl2-latest/lib64/libfjlapack.so: undefine
d reference to `__g_scns2'
>> 1473 /opt/FJSVxtclanga/tcsds-ssl2-latest/lib64/libfjlapack.so: undefine
d reference to `omp_get_max_threads_'
>> 1474 /opt/FJSVxtclanga/tcsds-ssl2-latest/lib64/libfjlapack.so: undefine
d reference to `__g_log'
>> 1475 /opt/FJSVxtclanga/tcsds-ssl2-latest/lib64/libfjlapack.so: undefine
d reference to `__g_datan2'
>> 1476 /opt/FJSVxtclanga/tcsds-ssl2-latest/lib64/libfjlapack.so: undefine
d reference to `__jwe_obar'
>> 1477 /opt/FJSVxtclanga/tcsds-ssl2-latest/lib64/libfjlapack.so: undefine
d reference to `__jwe_ilst'
>> 1478 /opt/FJSVxtclanga/tcsds-ssl2-latest/lib64/libfjlapack.so: undefine
d reference to `__jwe_opar'
>> 1479 /opt/FJSVxtclanga/tcsds-ssl2-latest/lib64/libfjlapack.so: undefine
d reference to `clock_'
>> 1480 /opt/FJSVxtclanga/tcsds-ssl2-latest/lib64/libfjlapack.so: undefine
d reference to `__g_exp'
>> 1481 clang-7: error: linker command failed with exit code 1 (use -v to
see invocation)
>> 1482 make[2]: *** [internal/ceres/CMakeFiles/autodiff_manifold_test.dir
/build.make:108: bin/autodiff_manifold_test] Error 1
1483 make[2]: Leaving directory '/vol0003/rccs-sdt/data/a01008/tmpdir/s
pack-stage/spack-stage-ceres-solver-2.2.0-j7udtyrqahn63jds37xrnprk
z5naicgb/spack-build-j7udtyr'
>> 1484 make[1]: *** [CMakeFiles/Makefile2:781: internal/ceres/CMakeFiles/
autodiff_manifold_test.dir/all] Error 2
1485 make[1]: Leaving directory '/vol0003/rccs-sdt/data/a01008/tmpdir/s
pack-stage/spack-stage-ceres-solver-2.2.0-j7udtyrqahn63jds37xrnprk
z5naicgb/spack-build-j7udtyr'
>> 1486 make: *** [Makefile:149: all] Error 2
See build log for details:
/data/rccs-sdt/a01008/tmpdir/spack-stage/spack-stage-ceres-solver-2.2.0-j7udtyrqahn63jds37xrnprkz5naicgb/spack-build-out.txt