List of Open Source Software which can be built on Fugaku

Spack logo
Spack will be used to manage open source software packages on Fugaku. Fugaku users can easily use pre-installed packages and built packages based on Spack recipes. The following list shows the results of building/compiling packages for aarch64 according to the Spack recipes. Note that the results in this list do not guarantee that each package will work properly. On the other hand, Fujitsu will provide the following packages compiled with Fujitsu compiler on Fugaku as "external" packages, of which Spack can be aware.
  • OpenJDK 11
  • Ruby 2.6.5 or later
  • Python2 2.7.15
  • Python3 3.6.8
  • Numpy 1.14.3
  • SciPy 1.0.0
  • Eclipse IDE 2019-09 R Packages
Please contact us from email:

chatterbug 1.0

Compiler Fujitsu Compiler Fujitsu C/C++ Compiler 4.10.0 tcsds-1.2.38
Result Dependency Error

Failed Reason

Failed to install dependency package :
------------------------------------------------
==> Warning: config:terminal_title has been replaced by install_status and is ignored
==> Warning: Failed to initialize repository: '$spack/var/spack/repos/local'.
No repo.yaml found in '$spack/var/spack/repos/local'
To remove the bad repository, run this command:
spack repo rm $spack/var/spack/repos/local
[+] /opt/FJSVxtclanga/tcsds-mpi-latest (external fujitsu-mpi-head-3njd5uwuazr4j2no6fqh4cpjmezknh3z)
[+] /usr (external gmake-4.2.1-eszqmok6vi6wxcmklx6bqloeidbh25kb)
==> Installing chatterbug-1.0-tjaoiu24mvqlmva6v56awdfttkgatnv5 [3/3]
==> No binary for chatterbug-1.0-tjaoiu24mvqlmva6v56awdfttkgatnv5 found: installing from source
==> No patches needed for chatterbug
==> chatterbug: Executing phase: 'edit'
==> chatterbug: Executing phase: 'build'
==> Error: ProcessError: Command exited with status 2:
'make' '-j16'

16 errors found in build log:
12 make[1]: Entering directory '/vol0003/rccs-sdt/data/a01008/tmpdir/sp
ack-stage/spack-stage-chatterbug-1.0-tjaoiu24mvqlmva6v56awdfttkgatnv
5/spack-src/pairs'
13 mpicxx -O3 -o pairs.x pairs.C
14 make[1]: Entering directory '/vol0003/rccs-sdt/data/a01008/tmpdir/sp
ack-stage/spack-stage-chatterbug-1.0-tjaoiu24mvqlmva6v56awdfttkgatnv
5/spack-src/ping-ping'
15 mpicxx -O3 -o ping-ping.x ping-ping.C
16 make[1]: mpicxx: Command not found
17 make[1]: mpicxx: Command not found
>> 18 make[1]: *** [Makefile:21: ping-ping.x] Error 127
19 make[1]: Leaving directory '/vol0003/rccs-sdt/data/a01008/tmpdir/spa
ck-stage/spack-stage-chatterbug-1.0-tjaoiu24mvqlmva6v56awdfttkgatnv5
/spack-src/ping-ping'
20 make[1]: Entering directory '/vol0003/rccs-sdt/data/a01008/tmpdir/sp
ack-stage/spack-stage-chatterbug-1.0-tjaoiu24mvqlmva6v56awdfttkgatnv
5/spack-src/spread'
21 mpicxx -O3 -o spread.x spread.C
>> 22 make: *** [Makefile:33: ping-ping] Error 2
23 make: *** Waiting for unfinished jobs....
24 make[1]: mpicxx: Command not found
>> 25 make[1]: *** [Makefile:21: pairs.x] Error 127
26 make[1]: Leaving directory '/vol0003/rccs-sdt/data/a01008/tmpdir/spa
ck-stage/spack-stage-chatterbug-1.0-tjaoiu24mvqlmva6v56awdfttkgatnv5
/spack-src/pairs'
>> 27 make: *** [Makefile:33: pairs] Error 2
>> 28 make[1]: *** [Makefile:21: spread.x] Error 127
29 make[1]: Leaving directory '/vol0003/rccs-sdt/data/a01008/tmpdir/spa
ck-stage/spack-stage-chatterbug-1.0-tjaoiu24mvqlmva6v56awdfttkgatnv5
/spack-src/spread'
>> 30 make: *** [Makefile:33: spread] Error 2
31 make[1]: Entering directory '/vol0003/rccs-sdt/data/a01008/tmpdir/sp
ack-stage/spack-stage-chatterbug-1.0-tjaoiu24mvqlmva6v56awdfttkgatnv
5/spack-src/stencil4d'
32 mpicxx -O3 -o stencil4d.x stencil4d.C
33 make[1]: Entering directory '/vol0003/rccs-sdt/data/a01008/tmpdir/sp
ack-stage/spack-stage-chatterbug-1.0-tjaoiu24mvqlmva6v56awdfttkgatnv
5/spack-src/stencil3d'
34 mpicxx -O3 -o stencil3d.x stencil3d.C
35 make[1]: mpicxx: Command not found
36 make[1]: mpicxx: Command not found
>> 37 make[1]: *** [Makefile:21: stencil4d.x] Error 127
38 make[1]: Leaving directory '/vol0003/rccs-sdt/data/a01008/tmpdir/spa
ck-stage/spack-stage-chatterbug-1.0-tjaoiu24mvqlmva6v56awdfttkgatnv5
/spack-src/stencil4d'
>> 39 make[1]: *** [Makefile:21: stencil3d.x] Error 127
40 make[1]: Leaving directory '/vol0003/rccs-sdt/data/a01008/tmpdir/spa
ck-stage/spack-stage-chatterbug-1.0-tjaoiu24mvqlmva6v56awdfttkgatnv5
/spack-src/stencil3d'
>> 41 make: *** [Makefile:33: stencil3d] Error 2
>> 42 make: *** [Makefile:33: stencil4d] Error 2
43 make[1]: Entering directory '/vol0003/rccs-sdt/data/a01008/tmpdir/sp
ack-stage/spack-stage-chatterbug-1.0-tjaoiu24mvqlmva6v56awdfttkgatnv
5/spack-src/subcom2d-coll'
44 mpicxx -O3 -o subcom2d-coll.x subcom2d-coll.C
45 make[1]: mpicxx: Command not found
46 make[1]: Entering directory '/vol0003/rccs-sdt/data/a01008/tmpdir/sp
ack-stage/spack-stage-chatterbug-1.0-tjaoiu24mvqlmva6v56awdfttkgatnv
5/spack-src/unstr-mesh'
47 mpicxx -O3 -o unstr-mesh.x unstr-mesh.C
>> 48 make[1]: *** [Makefile:21: subcom2d-coll.x] Error 127
49 make[1]: Leaving directory '/vol0003/rccs-sdt/data/a01008/tmpdir/spa
ck-stage/spack-stage-chatterbug-1.0-tjaoiu24mvqlmva6v56awdfttkgatnv5
/spack-src/subcom2d-coll'
50 make[1]: Entering directory '/vol0003/rccs-sdt/data/a01008/tmpdir/sp
ack-stage/spack-stage-chatterbug-1.0-tjaoiu24mvqlmva6v56awdfttkgatnv
5/spack-src/subcom3d-a2a'
51 mpicxx -O3 -o subcom3d-a2a.x subcom3d-a2a.C
52 make[1]: mpicxx: Command not found
>> 53 make: *** [Makefile:33: subcom2d-coll] Error 2
>> 54 make[1]: *** [Makefile:21: unstr-mesh.x] Error 127
55 make[1]: Leaving directory '/vol0003/rccs-sdt/data/a01008/tmpdir/spa
ck-stage/spack-stage-chatterbug-1.0-tjaoiu24mvqlmva6v56awdfttkgatnv5
/spack-src/unstr-mesh'
56 make[1]: mpicxx: Command not found
>> 57 make[1]: *** [Makefile:21: subcom3d-a2a.x] Error 127
58 make[1]: Leaving directory '/vol0003/rccs-sdt/data/a01008/tmpdir/spa
ck-stage/spack-stage-chatterbug-1.0-tjaoiu24mvqlmva6v56awdfttkgatnv5
/spack-src/subcom3d-a2a'
>> 59 make: *** [Makefile:33: unstr-mesh] Error 2
>> 60 make: *** [Makefile:33: subcom3d-a2a] Error 2

See build log for details:
/data/rccs-sdt/a01008/tmpdir/spack-stage/spack-stage-chatterbug-1.0-tjaoiu24mvqlmva6v56awdfttkgatnv5/spack-build-out.txt


<= Back to list