List of Open Source Software which can be built on Fugaku

Spack logo
Spack will be used to manage open source software packages on Fugaku. Fugaku users can easily use pre-installed packages and built packages based on Spack recipes. The following list shows the results of building/compiling packages for aarch64 according to the Spack recipes. Note that the results in this list do not guarantee that each package will work properly. On the other hand, Fujitsu will provide the following packages compiled with Fujitsu compiler on Fugaku as "external" packages, of which Spack can be aware.
  • OpenJDK 11
  • Ruby 2.6.5 or later
  • Python2 2.7.15
  • Python3 3.6.8
  • Numpy 1.14.3
  • SciPy 1.0.0
  • Eclipse IDE 2019-09 R Packages
Please contact us from email:

cqrlib 1.1.2

Compiler Fujitsu Compiler Fujitsu C/C++ Compiler 4.10.0 tcsds-1.2.38
Result Dependency Error

Failed Reason

Failed to install dependency package :
------------------------------------------------
==> Warning: config:terminal_title has been replaced by install_status and is ignored
==> Warning: Failed to initialize repository: '$spack/var/spack/repos/local'.
No repo.yaml found in '$spack/var/spack/repos/local'
To remove the bad repository, run this command:
spack repo rm $spack/var/spack/repos/local
[+] /usr (external gmake-4.2.1-eszqmok6vi6wxcmklx6bqloeidbh25kb)
[+] /usr (external libtool-2.4.6-c63win5txkc7eap5ppbbjjoaqyj5i6wx)
==> Installing cqrlib-1.1.2-y456rck6fua6ulk5cymapl4wku6br7fv [3/3]
==> No binary for cqrlib-1.1.2-y456rck6fua6ulk5cymapl4wku6br7fv found: installing from source
==> Fetching https://spack-llnl-mirror.s3-us-west-2.amazonaws.com/_source-cache/archive/af/af3cf2402974579f3c6efc6a6174a5da52786db4bfee9d38d504d93bc42410fd.tar.gz
==> Applied patch /vol0003/rccs-sdt/data/a01008/spack-all-test/env-20240227/spack/var/spack/repos/builtin/packages/cqrlib/cqr.patch
==> cqrlib: Executing phase: 'edit'
==> cqrlib: Executing phase: 'build'
==> cqrlib: Executing phase: 'install'
==> Error: ProcessError: Command exited with status 2:
'make' '-j16' 'install'

2 errors found in build log:
11 libtool --mode=link /vol0003/rccs-sdt/data/a01008/spack-all-test/env
-20240227/spack/lib/spack/env/fj/case-insensitive/FCC -g -O2 -Wall
-ansi -pedantic -DCQR_NOCCODE=1 -I. ./CPPQRTest.cpp -lm \
12 -o bin/CPPQRTest
13 mkdir -p /vol0003/rccs-sdt/data/a01008/spack-all-test/env-20240227/s
pack/opt/spack/linux-rhel8-a64fx/fj-4.10.0/cqrlib-1.1.2-y456rck6fua6
ulk5cymapl4wku6br7fv/lib
14 mkdir -p /vol0003/rccs-sdt/data/a01008/spack-all-test/env-20240227/s
pack/opt/spack/linux-rhel8-a64fx/fj-4.10.0/cqrlib-1.1.2-y456rck6fua6
ulk5cymapl4wku6br7fv/include
15 libtool: compile: unable to infer tagged configuration
16 libtool: error: specify a tag with '--tag'
>> 17 make: *** [Makefile:257: lib/libCQRlib.la] Error 1
18 make: *** Waiting for unfinished jobs....
19 libtool: link: unable to infer tagged configuration
20 libtool: error: specify a tag with '--tag'
>> 21 make: *** [Makefile:271: bin/CPPQRTest] Error 1

See build log for details:
/data/rccs-sdt/a01008/tmpdir/spack-stage/spack-stage-cqrlib-1.1.2-y456rck6fua6ulk5cymapl4wku6br7fv/spack-build-out.txt


<= Back to list