List of Open Source Software which can be built on Fugaku

Spack logo
Spack will be used to manage open source software packages on Fugaku. Fugaku users can easily use pre-installed packages and built packages based on Spack recipes. The following list shows the results of building/compiling packages for aarch64 according to the Spack recipes. Note that the results in this list do not guarantee that each package will work properly. On the other hand, Fujitsu will provide the following packages compiled with Fujitsu compiler on Fugaku as "external" packages, of which Spack can be aware.
  • OpenJDK 11
  • Ruby 2.6.5 or later
  • Python2 2.7.15
  • Python3 3.6.8
  • Numpy 1.14.3
  • SciPy 1.0.0
  • Eclipse IDE 2019-09 R Packages
Please contact us from email:

g2 3.4.8

Compiler Fujitsu Compiler Fujitsu C/C++ Compiler 4.10.0 tcsds-1.2.38
Result Dependency Error

Failed Reason

Failed to install dependency package :
------------------------------------------------
t/env-20240227/spack/opt/spack/linux-rhel8-a64fx/fj-4.10.0/bacio-2.
4.1-zlntpuvbrgkt6m735gjwv6s4nam2lidg/include_4 -O3 -DNDEBUG -M incl
ude_d -fPIC -c /data/rccs-sdt/a01008/tmpdir/spack-stage/spack-stage
-w3emc-2.11.0-n543o2chbo2n3dbvboxy2eqs463xitlg/spack-src/src/w3fm07
.f -o CMakeFiles/w3emc_d.dir/w3fm07.f.o
351 [ 26%] Building Fortran object src/CMakeFiles/w3emc_d.dir/w3fm08.f.
o
352 cd /vol0003/rccs-sdt/data/a01008/tmpdir/spack-stage/spack-stage-w3e
mc-2.11.0-n543o2chbo2n3dbvboxy2eqs463xitlg/spack-build-n543o2c/src
&& /vol0003/rccs-sdt/data/a01008/spack-all-test/env-20240227/spack/
lib/spack/env/fj/frt -I/vol0003/rccs-sdt/data/a01008/spack-all-tes
t/env-20240227/spack/opt/spack/linux-rhel8-a64fx/fj-4.10.0/bacio-2.
4.1-zlntpuvbrgkt6m735gjwv6s4nam2lidg/include_4 -O3 -DNDEBUG -M incl
ude_d -fPIC -c /data/rccs-sdt/a01008/tmpdir/spack-stage/spack-stage
-w3emc-2.11.0-n543o2chbo2n3dbvboxy2eqs463xitlg/spack-src/src/w3fm08
.f -o CMakeFiles/w3emc_d.dir/w3fm08.f.o
353 [ 26%] Building Fortran object src/CMakeFiles/w3emc_d.dir/w3fp04.f.
o
354 cd /vol0003/rccs-sdt/data/a01008/tmpdir/spack-stage/spack-stage-w3e
mc-2.11.0-n543o2chbo2n3dbvboxy2eqs463xitlg/spack-build-n543o2c/src
&& /vol0003/rccs-sdt/data/a01008/spack-all-test/env-20240227/spack/
lib/spack/env/fj/frt -I/vol0003/rccs-sdt/data/a01008/spack-all-tes
t/env-20240227/spack/opt/spack/linux-rhel8-a64fx/fj-4.10.0/bacio-2.
4.1-zlntpuvbrgkt6m735gjwv6s4nam2lidg/include_4 -O3 -DNDEBUG -M incl
ude_d -fPIC -c /data/rccs-sdt/a01008/tmpdir/spack-stage/spack-stage
-w3emc-2.11.0-n543o2chbo2n3dbvboxy2eqs463xitlg/spack-src/src/w3fp04
.f -o CMakeFiles/w3emc_d.dir/w3fp04.f.o

...

425 jwd0510i-w "/data/rccs-sdt/a01008/tmpdir/spack-stage/spack-stage
-w3emc-2.11.0-n543o2chbo2n3dbvboxy2eqs463xitlg/spack-src/src/w3fp05
.f", line 101: Character type cannot be mixed with other type in in
itializations, assignments, relational operations, statement functi
on definitions or PARAMETER statements.
426 jwd2004i-i "/data/rccs-sdt/a01008/tmpdir/spack-stage/spack-stage
-w3emc-2.11.0-n543o2chbo2n3dbvboxy2eqs463xitlg/spack-src/src/w3fp05
.f", line 220: 'JMIN' is set but never used.
427 jwd2004i-i "/data/rccs-sdt/a01008/tmpdir/spack-stage/spack-stage
-w3emc-2.11.0-n543o2chbo2n3dbvboxy2eqs463xitlg/spack-src/src/w3fp05
.f", line 521: 'KPD' is set but never used.
428 Fortran diagnostic messages: program name(W3FI85)
429 jwd2006i-i "/data/rccs-sdt/a01008/tmpdir/spack-stage/spack-stage
-w3emc-2.11.0-n543o2chbo2n3dbvboxy2eqs463xitlg/spack-src/src/w3fi85
.f", line 224: 'AHOLD' is declared but never referenced.
430 jwd2004i-i "/data/rccs-sdt/a01008/tmpdir/spack-stage/spack-stage
-w3emc-2.11.0-n543o2chbo2n3dbvboxy2eqs463xitlg/spack-src/src/w3fi85
.f", line 352: 'KWORD' is set but never used.
>> 431 make[2]: *** [src/CMakeFiles/w3emc_d.dir/build.make:793: src/CMakeF
iles/w3emc_d.dir/w3fp05.f.o] Error 1
432 make[2]: *** Waiting for unfinished jobs....
433 Fortran diagnostic messages: program name(FI8506)
434 jwd2008i-i "/data/rccs-sdt/a01008/tmpdir/spack-stage/spack-stage
-w3emc-2.11.0-n543o2chbo2n3dbvboxy2eqs463xitlg/spack-src/src/w3fi85
.f", line 1482: Dummy argument 'KSCALE' not used in this subprogram
.
435 jwd2008i-i "/data/rccs-sdt/a01008/tmpdir/spack-stage/spack-stage
-w3emc-2.11.0-n543o2chbo2n3dbvboxy2eqs463xitlg/spack-src/src/w3fi85
.f", line 1488: Dummy argument 'ANAME' not used in this subprogram.
436 Fortran diagnostic messages: program name(W3FP10)
437 jwd1101i-s "/data/rccs-sdt/a01008/tmpdir/spack-stage/spack-stage
-w3emc-2.11.0-n543o2chbo2n3dbvboxy2eqs463xitlg/spack-src/src/w3fp10
.f", line 101, column 21: Real or complex value overflows.
438 jwd2004i-i "/data/rccs-sdt/a01008/tmpdir/spack-stage/spack-stage
-w3emc-2.11.0-n543o2chbo2n3dbvboxy2eqs463xitlg/spack-src/src/w3fp10
.f", line 229: 'JMAX' is set but never used.
>> 439 make[2]: *** [src/CMakeFiles/w3emc_d.dir/build.make:819: src/CMakeF
iles/w3emc_d.dir/w3fp10.f.o] Error 1
440 Fortran diagnostic messages: program name(FI8502)
441 jwd2008i-i "/data/rccs-sdt/a01008/tmpdir/spack-stage/spack-stage
-w3emc-2.11.0-n543o2chbo2n3dbvboxy2eqs463xitlg/spack-src/src/w3fi85
.f", line 1119: Dummy argument 'LDESC' not used in this subprogram.
442 jwd2008i-i "/data/rccs-sdt/a01008/tmpdir/spack-stage/spack-stage
-w3emc-2.11.0-n543o2chbo2n3dbvboxy2eqs463xitlg/spack-src/src/w3fi85
.f", line 1119: Dummy argument 'NEWRFV' not used in this subprogram
.
443 [ 28%] Building Fortran object src/CMakeFiles/w3emc_d.dir/w3ft05v.f
.o
444 Fortran diagnostic messages: program name(FI8508)
445 jwd2429i-i "/data/rccs-sdt/a01008/tmpdir/spack-stage/spack-stage
-w3emc-2.11.0-n543o2chbo2n3dbvboxy2eqs463xitlg/spack-src/src/w3fi85
.f", line 1791: Character type or character sequence type variable
mixed with variables of other types in the equivalence set.

...

466 jwd2004i-i "/data/rccs-sdt/a01008/tmpdir/spack-stage/spack-stage
-w3emc-2.11.0-n543o2chbo2n3dbvboxy2eqs463xitlg/spack-src/src/w3fi78
.f", line 2322: 'NDIR' is set but never used.
467 jwd2004i-i "/data/rccs-sdt/a01008/tmpdir/spack-stage/spack-stage
-w3emc-2.11.0-n543o2chbo2n3dbvboxy2eqs463xitlg/spack-src/src/w3fi78
.f", line 2324: 'NSPD' is set but never used.
468 Fortran diagnostic messages: program name(FI6709)
469 jwd2004i-i "/data/rccs-sdt/a01008/tmpdir/spack-stage/spack-stage
-w3emc-2.11.0-n543o2chbo2n3dbvboxy2eqs463xitlg/spack-src/src/w3fi67
.f", line 2228: 'NDIR' is set but never used.
470 jwd2004i-i "/data/rccs-sdt/a01008/tmpdir/spack-stage/spack-stage
-w3emc-2.11.0-n543o2chbo2n3dbvboxy2eqs463xitlg/spack-src/src/w3fi67
.f", line 2230: 'NSPD' is set but never used.
471 make[2]: Leaving directory '/vol0003/rccs-sdt/data/a01008/tmpdir/sp
ack-stage/spack-stage-w3emc-2.11.0-n543o2chbo2n3dbvboxy2eqs463xitlg
/spack-build-n543o2c'
>> 472 make[1]: *** [CMakeFiles/Makefile2:927: src/CMakeFiles/w3emc_4.dir/
all] Error 2
473 make[1]: *** Waiting for unfinished jobs....
474 Fortran diagnostic messages: program name(FI8508)
475 jwd2429i-i "/data/rccs-sdt/a01008/tmpdir/spack-stage/spack-stage
-w3emc-2.11.0-n543o2chbo2n3dbvboxy2eqs463xitlg/spack-src/src/w3fi85
.f", line 1791: Character type or character sequence type variable
mixed with variables of other types in the equivalence set.
476 jwd2004i-i "/data/rccs-sdt/a01008/tmpdir/spack-stage/spack-stage
-w3emc-2.11.0-n543o2chbo2n3dbvboxy2eqs463xitlg/spack-src/src/w3fi85
.f", line 1904: 'KREQ' is set but never used.
477 Fortran diagnostic messages: program name(FI8509)
478 jwd2429i-i "/data/rccs-sdt/a01008/tmpdir/spack-stage/spack-stage
-w3emc-2.11.0-n543o2chbo2n3dbvboxy2eqs463xitlg/spack-src/src/w3fi85
.f", line 2019: Character type or character sequence type variable
mixed with variables of other types in the equivalence set.

...

480 Fortran diagnostic messages: program name(FI8511)
481 jwd2008i-i "/data/rccs-sdt/a01008/tmpdir/spack-stage/spack-stage
-w3emc-2.11.0-n543o2chbo2n3dbvboxy2eqs463xitlg/spack-src/src/w3fi85
.f", line 2208: Dummy argument 'KARY' not used in this subprogram.
482 jwd2008i-i "/data/rccs-sdt/a01008/tmpdir/spack-stage/spack-stage
-w3emc-2.11.0-n543o2chbo2n3dbvboxy2eqs463xitlg/spack-src/src/w3fi85
.f", line 2209: Dummy argument 'ISECT3' not used in this subprogram
.
483 Fortran diagnostic messages: program name(FI8512)
484 jwd2004i-i "/data/rccs-sdt/a01008/tmpdir/spack-stage/spack-stage
-w3emc-2.11.0-n543o2chbo2n3dbvboxy2eqs463xitlg/spack-src/src/w3fi85
.f", line 2367: 'KF' is set but never used.
485 make[2]: Leaving directory '/vol0003/rccs-sdt/data/a01008/tmpdir/sp
ack-stage/spack-stage-w3emc-2.11.0-n543o2chbo2n3dbvboxy2eqs463xitlg
/spack-build-n543o2c'
>> 486 make[1]: *** [CMakeFiles/Makefile2:953: src/CMakeFiles/w3emc_d.dir/
all] Error 2
487 make[1]: Leaving directory '/vol0003/rccs-sdt/data/a01008/tmpdir/sp
ack-stage/spack-stage-w3emc-2.11.0-n543o2chbo2n3dbvboxy2eqs463xitlg
/spack-build-n543o2c'
>> 488 make: *** [Makefile:149: all] Error 2

See build log for details:
/data/rccs-sdt/a01008/tmpdir/spack-stage/spack-stage-w3emc-2.11.0-n543o2chbo2n3dbvboxy2eqs463xitlg/spack-build-out.txt

==> Warning: Skipping build of g2-3.4.8-myccqsmoidjyvkfzhewykhneexmuvlx3 since w3emc-2.11.0-n543o2chbo2n3dbvboxy2eqs463xitlg failed
==> Error: g2-3.4.8-myccqsmoidjyvkfzhewykhneexmuvlx3: Package was not installed
==> Error: Installation request failed. Refer to reported errors for failing package(s).
[+] /vol0003/rccs-sdt/data/a01008/spack-all-test/env-20240227/spack/opt/spack/linux-rhel8-a64fx/fj-4.10.0/jasper-3.0.3-wizwelxkmtvyclm426rjyf4ywwd7xjja


<= Back to list