List of Open Source Software which can be built on Fugaku

Spack logo
Spack will be used to manage open source software packages on Fugaku. Fugaku users can easily use pre-installed packages and built packages based on Spack recipes. The following list shows the results of building/compiling packages for aarch64 according to the Spack recipes. Note that the results in this list do not guarantee that each package will work properly. On the other hand, Fujitsu will provide the following packages compiled with Fujitsu compiler on Fugaku as "external" packages, of which Spack can be aware.
  • OpenJDK 11
  • Ruby 2.6.5 or later
  • Python2 2.7.15
  • Python3 3.6.8
  • Numpy 1.14.3
  • SciPy 1.0.0
  • Eclipse IDE 2019-09 R Packages
Please contact us from email:

gadap 2.0

Compiler Fujitsu Compiler Fujitsu C/C++ Compiler 4.10.0 tcsds-1.2.38
Result Dependency Error

Failed Reason

Failed to install dependency package :
------------------------------------------------
==> Warning: config:terminal_title has been replaced by install_status and is ignored
==> Warning: Failed to initialize repository: '$spack/var/spack/repos/local'.
No repo.yaml found in '$spack/var/spack/repos/local'
To remove the bad repository, run this command:
spack repo rm $spack/var/spack/repos/local
[+] /usr (external curl-7.61.1-qsvgylcys5hkzdnl2pdh4blrprxlsp5m)
[+] /usr (external gmake-4.2.1-eszqmok6vi6wxcmklx6bqloeidbh25kb)
[+] /vol0003/rccs-sdt/data/a01008/spack-all-test/env-20240227/spack/opt/spack/linux-rhel8-a64fx/fj-4.10.0/gnuconfig-2022-09-17-w33oejhx46ex2iql4orzjqdmt2kdqdb2
[+] /usr (external autoconf-2.69-titfazaulrbnqxmahzxzof53lmsnabip)
[+] /usr (external automake-1.16.1-fryterkxezzfuo7itm4kijqfnazo5uk4)
[+] /usr (external gettext-0.19.8.1-6jl23wn6jpwquhvqibpwhvia7vxsgrq3)
[+] /usr (external m4-1.4.18-craoyd3hmfdcanz7zxglna5yxcvdtoem)
[+] /usr (external libtool-2.4.6-c63win5txkc7eap5ppbbjjoaqyj5i6wx)
[+] /usr (external libxml2-2.9.7-psbfksllqwmljlwwnb24enmihejo6ws6)
[+] /vol0003/rccs-sdt/data/a01008/spack-all-test/env-20240227/spack/opt/spack/linux-rhel8-a64fx/fj-4.10.0/util-linux-uuid-2.38.1-ntavqwk5vtgxjkupp5lcart6ah2uuwi5
[+] /vol0003/rccs-sdt/data/a01008/spack-all-test/env-20240227/spack/opt/spack/linux-rhel8-a64fx/fj-4.10.0/bison-3.8.2-kviw7pt3aorzqonkoy2vxqd5nzod5xdv
[+] /vol0003/rccs-sdt/data/a01008/spack-all-test/env-20240227/spack/opt/spack/linux-rhel8-a64fx/fj-4.10.0/flex-2.6.3-udlfzibabfli2hc4lyhfxk7p5xd3pv4f
==> Installing libdap4-3.20.6-evptdlspauqjsfpso4prcjmece6vpyia [13/14]
==> No binary for libdap4-3.20.6-evptdlspauqjsfpso4prcjmece6vpyia found: installing from source
==> Fetching https://spack-llnl-mirror.s3-us-west-2.amazonaws.com/_source-cache/archive/e4/e44e83043c158d8c9d0a37a1821626ab0db4a1a6578b02182440170c0b060e6d.tar.gz
==> No patches needed for libdap4
==> libdap4: Executing phase: 'autoreconf'
==> libdap4: Executing phase: 'configure'
==> libdap4: Executing phase: 'build'
==> libdap4: Executing phase: 'install'
==> libdap4: Successfully installed libdap4-3.20.6-evptdlspauqjsfpso4prcjmece6vpyia
Stage: 39.70s. Autoreconf: 58.79s. Configure: 4m 21.35s. Build: 6m 48.76s. Install: 11.79s. Post-install: 3.09s. Total: 13m 6.43s
[+] /vol0003/rccs-sdt/data/a01008/spack-all-test/env-20240227/spack/opt/spack/linux-rhel8-a64fx/fj-4.10.0/libdap4-3.20.6-evptdlspauqjsfpso4prcjmece6vpyia
==> Installing gadap-2.0-gsnksgbuvfb3z7x3va3w32xzir4cbhct [14/14]
==> No binary for gadap-2.0-gsnksgbuvfb3z7x3va3w32xzir4cbhct found: installing from source
==> Fetching https://spack-llnl-mirror.s3-us-west-2.amazonaws.com/_source-cache/archive/ae/ae9a989ca00ec29fb40616383d170883f07c022456db338399982a8a94ec0100.tar.gz
==> Applied patch /vol0003/rccs-sdt/data/a01008/spack-all-test/env-20240227/spack/var/spack/repos/builtin/packages/gadap/cxx-updates.patch
==> gadap: Executing phase: 'autoreconf'
==> gadap: Executing phase: 'configure'
==> gadap: Executing phase: 'build'
==> Error: ProcessError: Command exited with status 2:
'make' '-j16' 'V=1'

12 errors found in build log:
65 then mv -f ".deps/gaUtils.Tpo" ".deps/gaUtils.Po"; else rm -f ".dep
s/gaUtils.Tpo"; exit 1; fi
66 if /vol0003/rccs-sdt/data/a01008/spack-all-test/env-20240227/spack/
lib/spack/env/fj/case-insensitive/FCC -DHAVE_CONFIG_H -I. -I/data/r
ccs-sdt/a01008/tmpdir/spack-stage/spack-stage-gadap-2.0-gsnksgbuvfb
3z7x3va3w32xzir4cbhct/spack-src/src -I.. -I/vol0003/rccs-sdt/data
/a01008/spack-all-test/env-20240227/spack/opt/spack/linux-rhel8-a64
fx/fj-4.10.0/libdap4-3.20.6-evptdlspauqjsfpso4prcjmece6vpyia/includ
e/libdap -I/usr/include/libxml2 -fPIC -MT gadap.o -MD -MP -MF "
.deps/gadap.Tpo" -c -o gadap.o gadap.cc; \
67 then mv -f ".deps/gadap.Tpo" ".deps/gadap.Po"; else rm -f ".deps/ga
dap.Tpo"; exit 1; fi
68 In file included from gaBaseTypes.cc:23:
69 In file included from /vol0003/rccs-sdt/data/a01008/spack-all-test/
env-20240227/spack/opt/spack/linux-rhel8-a64fx/fj-4.10.0/libdap4-3.
20.6-evptdlspauqjsfpso4prcjmece6vpyia/include/libdap/Sequence.h:50:
70 In file included from /vol0003/rccs-sdt/data/a01008/spack-all-test/
env-20240227/spack/opt/spack/linux-rhel8-a64fx/fj-4.10.0/libdap4-3.
20.6-evptdlspauqjsfpso4prcjmece6vpyia/include/libdap/XDRUtils.h:37:
>> 71 /vol0003/rccs-sdt/data/a01008/spack-all-test/env-20240227/spack/opt
/spack/linux-rhel8-a64fx/fj-4.10.0/libdap4-3.20.6-evptdlspauqjsfpso
4prcjmece6vpyia/include/libdap/xdr-datatypes.h:16:10: fatal error:
'rpc/types.h' file not found
72 #include <rpc/types.h>
73 ^~~~~~~~~~~~~
74 In file included from gaConnect.cc:15:
75 In file included from ./gaConnect.h:20:
76 In file included from ./gaReports.h:19:
77 In file included from /vol0003/rccs-sdt/data/a01008/spack-all-test/
env-20240227/spack/opt/spack/linux-rhel8-a64fx/fj-4.10.0/libdap4-3.
20.6-evptdlspauqjsfpso4prcjmece6vpyia/include/libdap/Sequence.h:50:
78 In file included from /vol0003/rccs-sdt/data/a01008/spack-all-test/
env-20240227/spack/opt/spack/linux-rhel8-a64fx/fj-4.10.0/libdap4-3.
20.6-evptdlspauqjsfpso4prcjmece6vpyia/include/libdap/XDRUtils.h:37:
>> 79 /vol0003/rccs-sdt/data/a01008/spack-all-test/env-20240227/spack/opt
/spack/linux-rhel8-a64fx/fj-4.10.0/libdap4-3.20.6-evptdlspauqjsfpso
4prcjmece6vpyia/include/libdap/xdr-datatypes.h:16:10: fatal error:
'rpc/types.h' file not found
80 #include <rpc/types.h>
81 ^~~~~~~~~~~~~
82 1 error generated.
83 In file included from gaReports.cc:16:
84 In file included from ./gaReports.h:19:
85 In file included from /vol0003/rccs-sdt/data/a01008/spack-all-test/
env-20240227/spack/opt/spack/linux-rhel8-a64fx/fj-4.10.0/libdap4-3.
20.6-evptdlspauqjsfpso4prcjmece6vpyia/include/libdap/Sequence.h:50:
86 In file included from /vol0003/rccs-sdt/data/a01008/spack-all-test/
env-20240227/spack/opt/spack/linux-rhel8-a64fx/fj-4.10.0/libdap4-3.
20.6-evptdlspauqjsfpso4prcjmece6vpyia/include/libdap/XDRUtils.h:37:
>> 87 /vol0003/rccs-sdt/data/a01008/spack-all-test/env-20240227/spack/opt
/spack/linux-rhel8-a64fx/fj-4.10.0/libdap4-3.20.6-evptdlspauqjsfpso
4prcjmece6vpyia/include/libdap/xdr-datatypes.h:16:10: fatal error:
'rpc/types.h' file not found
88 #include <rpc/types.h>
89 ^~~~~~~~~~~~~
>> 90 make[2]: *** [Makefile:255: gaBaseTypes.o] Error 1
91 make[2]: *** Waiting for unfinished jobs....
92 1 error generated.
>> 93 make[2]: *** [Makefile:255: gaConnect.o] Error 1
94 1 error generated.
95 In file included from gadap.cc:16:
96 In file included from ./gaConnect.h:20:
97 In file included from ./gaReports.h:19:
98 In file included from /vol0003/rccs-sdt/data/a01008/spack-all-test/
env-20240227/spack/opt/spack/linux-rhel8-a64fx/fj-4.10.0/libdap4-3.
20.6-evptdlspauqjsfpso4prcjmece6vpyia/include/libdap/Sequence.h:50:
99 In file included from /vol0003/rccs-sdt/data/a01008/spack-all-test/
env-20240227/spack/opt/spack/linux-rhel8-a64fx/fj-4.10.0/libdap4-3.
20.6-evptdlspauqjsfpso4prcjmece6vpyia/include/libdap/XDRUtils.h:37:
>> 100 /vol0003/rccs-sdt/data/a01008/spack-all-test/env-20240227/spack/opt
/spack/linux-rhel8-a64fx/fj-4.10.0/libdap4-3.20.6-evptdlspauqjsfpso
4prcjmece6vpyia/include/libdap/xdr-datatypes.h:16:10: fatal error:
'rpc/types.h' file not found
101 #include <rpc/types.h>
102 ^~~~~~~~~~~~~
>> 103 make[2]: *** [Makefile:255: gaReports.o] Error 1
104 In file included from gaUtils.cc:18:
105 In file included from ./gaUtils.h:23:
106 In file included from /vol0003/rccs-sdt/data/a01008/spack-all-test/
env-20240227/spack/opt/spack/linux-rhel8-a64fx/fj-4.10.0/libdap4-3.
20.6-evptdlspauqjsfpso4prcjmece6vpyia/include/libdap/Sequence.h:50:
107 In file included from /vol0003/rccs-sdt/data/a01008/spack-all-test/
env-20240227/spack/opt/spack/linux-rhel8-a64fx/fj-4.10.0/libdap4-3.
20.6-evptdlspauqjsfpso4prcjmece6vpyia/include/libdap/XDRUtils.h:37:
>> 108 /vol0003/rccs-sdt/data/a01008/spack-all-test/env-20240227/spack/opt
/spack/linux-rhel8-a64fx/fj-4.10.0/libdap4-3.20.6-evptdlspauqjsfpso
4prcjmece6vpyia/include/libdap/xdr-datatypes.h:16:10: fatal error:
'rpc/types.h' file not found
109 #include <rpc/types.h>
110 ^~~~~~~~~~~~~
111 1 error generated.
>> 112 make[2]: *** [Makefile:255: gadap.o] Error 1
113 1 error generated.
>> 114 make[2]: *** [Makefile:255: gaUtils.o] Error 1
115 make[2]: Leaving directory '/vol0003/rccs-sdt/data/a01008/tmpdir/sp
ack-stage/spack-stage-gadap-2.0-gsnksgbuvfb3z7x3va3w32xzir4cbhct/sp
ack-src/src'
>> 116 make[1]: *** [Makefile:250: all-recursive] Error 1
117 make[1]: Leaving directory '/vol0003/rccs-sdt/data/a01008/tmpdir/sp
ack-stage/spack-stage-gadap-2.0-gsnksgbuvfb3z7x3va3w32xzir4cbhct/sp
ack-src'
>> 118 make: *** [Makefile:167: all] Error 2

See build log for details:
/data/rccs-sdt/a01008/tmpdir/spack-stage/spack-stage-gadap-2.0-gsnksgbuvfb3z7x3va3w32xzir4cbhct/spack-build-out.txt


<= Back to list