Spack will be used to manage open source software packages on Fugaku.
Fugaku users can easily use pre-installed packages and built packages based on Spack recipes.
The following list shows the results of building/compiling packages for aarch64 according to the Spack recipes.
Note that the results in this list do not guarantee that each package will work properly.
On the other hand, Fujitsu will provide the following packages compiled with Fujitsu compiler on Fugaku as "external" packages, of which Spack can be aware.
![]() |
Compiler | Fujitsu Compiler Fujitsu C/C++ Compiler 4.10.0 tcsds-1.2.38 |
---|---|
Result | Dependency Error |
Failed to install dependency package :
------------------------------------------------
==> Warning: config:terminal_title has been replaced by install_status and is ignored
==> Warning: Failed to initialize repository: '$spack/var/spack/repos/local'.
No repo.yaml found in '$spack/var/spack/repos/local'
To remove the bad repository, run this command:
spack repo rm $spack/var/spack/repos/local
[+] /usr (external curl-7.61.1-qsvgylcys5hkzdnl2pdh4blrprxlsp5m)
[+] /usr (external ncurses-6.1-a6lc7oq2dlgphtibbpp6x72mqgmscros)
[+] /vol0003/rccs-sdt/data/a01008/spack-all-test/env-20240227/spack/opt/spack/linux-rhel8-a64fx/fj-4.10.0/zlib-ng-2.1.4-m4nsqgrityww4eqljits3svzi4wynus3
[+] /opt/FJSVxtclanga/tcsds-mpi-latest (external fujitsu-mpi-head-3njd5uwuazr4j2no6fqh4cpjmezknh3z)
[+] /opt/FJSVxtclanga/tcsds-ssl2-latest (external fujitsu-ssl2-head-7eif42hdxt2tixz7cufiyhj62kz3jntb)
[+] /usr (external gmake-4.2.1-eszqmok6vi6wxcmklx6bqloeidbh25kb)
[+] /vol0003/rccs-sdt/data/a01008/spack-all-test/env-20240227/spack/opt/spack/linux-rhel8-a64fx/fj-4.10.0/gnuconfig-2022-09-17-w33oejhx46ex2iql4orzjqdmt2kdqdb2
[+] /usr (external libpciaccess-0.14-5v7kdzaldflq3xxitcnxlc2swcce2hpp)
[+] /usr (external libxml2-2.9.7-psbfksllqwmljlwwnb24enmihejo6ws6)
[+] /usr (external pkgconf-1.4.2-mmjuloqcob6vnd6bylwgum67waaa3kht)
[+] /vol0003/rccs-sdt/data/a01008/spack-all-test/env-20240227/spack/opt/spack/linux-rhel8-a64fx/fj-4.10.0/cmake-3.27.7-ussgjuqkqbxi5dcv7kbp6bugdcjc5ph6
==> Installing hwloc-1.11.13-fyw4zogmwdnv3n57fkqa7h4nbfxjttsj [12/13]
==> No binary for hwloc-1.11.13-fyw4zogmwdnv3n57fkqa7h4nbfxjttsj found: installing from source
==> Fetching https://spack-llnl-mirror.s3-us-west-2.amazonaws.com/_source-cache/archive/a8/a8f781ae4d347708a07d95e7549039887f151ed7f92263238527dfb0a3709b9d.tar.gz
==> Applied patch /vol0003/rccs-sdt/data/a01008/spack-all-test/env-20240227/spack/var/spack/repos/builtin/packages/hwloc/0001-Try-linking-to-libtinfo.patch
==> hwloc: Executing phase: 'autoreconf'
==> hwloc: Executing phase: 'configure'
==> hwloc: Executing phase: 'build'
==> hwloc: Executing phase: 'install'
==> hwloc: Successfully installed hwloc-1.11.13-fyw4zogmwdnv3n57fkqa7h4nbfxjttsj
Stage: 31.11s. Autoreconf: 1.42s. Configure: 3m 28.27s. Build: 1m 37.54s. Install: 12.26s. Post-install: 5.00s. Total: 5m 56.66s
[+] /vol0003/rccs-sdt/data/a01008/spack-all-test/env-20240227/spack/opt/spack/linux-rhel8-a64fx/fj-4.10.0/hwloc-1.11.13-fyw4zogmwdnv3n57fkqa7h4nbfxjttsj
==> Installing ghost-develop-yrocrnlaw4prmghqzlv35qi5uv2rbzie [13/13]
==> No binary for ghost-develop-yrocrnlaw4prmghqzlv35qi5uv2rbzie found: installing from source
==> No patches needed for ghost
==> ghost: Executing phase: 'cmake'
==> ghost: Executing phase: 'build'
==> Error: ProcessError: Command exited with status 2:
'make' '-j16'
4 errors found in build log:
769 [ 39%] Building C object CMakeFiles/ghost.dir/src/blas_util.c.o
770 /vol0003/rccs-sdt/data/a01008/spack-all-test/env-20240227/spack/lib
/spack/env/fj/fcc -DIACA_MARKS_OFF -DMPICH_IGNORE_CXX_SEEK -DMPICH_
SKIP_MPICXX -D_FILE_OFFSET_BITS=64 -D_LARGEFILE64_SOURCE -Dghost_EX
PORTS -I/data/rccs-sdt/a01008/tmpdir/spack-stage/spack-stage-ghost-
develop-yrocrnlaw4prmghqzlv35qi5uv2rbzie/spack-src/include -I/vol00
03/rccs-sdt/data/a01008/tmpdir/spack-stage/spack-stage-ghost-develo
p-yrocrnlaw4prmghqzlv35qi5uv2rbzie/spack-build-yrocrnl -I/vol0003/r
ccs-sdt/data/a01008/tmpdir/spack-stage/spack-stage-ghost-develop-yr
ocrnlaw4prmghqzlv35qi5uv2rbzie/spack-build-yrocrnl/ghost -I/vol0003
/rccs-sdt/data/a01008/spack-all-test/env-20240227/spack/opt/spack/l
inux-rhel8-a64fx/fj-4.10.0/hwloc-1.11.13-fyw4zogmwdnv3n57fkqa7h4nbf
xjttsj/include -isystem /opt/FJSVxtclanga/.common/MECA029/include/m
pi/fujitsu -isystem /opt/FJSVxtclanga/tcsds-ssl2-latest/clang-comp/
include -fopenmp -fPIC -std=c99 -Wall -Wextra -pedantic -Wno-unknow
n-pragmas -O3 -DNDEBUG -fPIC -MD -MT CMakeFiles/ghost.dir/src/blas_
util.c.o -MF CMakeFiles/ghost.dir/src/blas_util.c.o.d -o CMakeFiles
/ghost.dir/src/blas_util.c.o -c /data/rccs-sdt/a01008/tmpdir/spack-
stage/spack-stage-ghost-develop-yrocrnlaw4prmghqzlv35qi5uv2rbzie/sp
ack-src/src/blas_util.c
771 [ 40%] Building C object CMakeFiles/ghost.dir/src/carp.c.o
772 /vol0003/rccs-sdt/data/a01008/spack-all-test/env-20240227/spack/lib
/spack/env/fj/fcc -DIACA_MARKS_OFF -DMPICH_IGNORE_CXX_SEEK -DMPICH_
SKIP_MPICXX -D_FILE_OFFSET_BITS=64 -D_LARGEFILE64_SOURCE -Dghost_EX
PORTS -I/data/rccs-sdt/a01008/tmpdir/spack-stage/spack-stage-ghost-
develop-yrocrnlaw4prmghqzlv35qi5uv2rbzie/spack-src/include -I/vol00
03/rccs-sdt/data/a01008/tmpdir/spack-stage/spack-stage-ghost-develo
p-yrocrnlaw4prmghqzlv35qi5uv2rbzie/spack-build-yrocrnl -I/vol0003/r
ccs-sdt/data/a01008/tmpdir/spack-stage/spack-stage-ghost-develop-yr
ocrnlaw4prmghqzlv35qi5uv2rbzie/spack-build-yrocrnl/ghost -I/vol0003
/rccs-sdt/data/a01008/spack-all-test/env-20240227/spack/opt/spack/l
inux-rhel8-a64fx/fj-4.10.0/hwloc-1.11.13-fyw4zogmwdnv3n57fkqa7h4nbf
xjttsj/include -isystem /opt/FJSVxtclanga/.common/MECA029/include/m
pi/fujitsu -isystem /opt/FJSVxtclanga/tcsds-ssl2-latest/clang-comp/
include -fopenmp -fPIC -std=c99 -Wall -Wextra -pedantic -Wno-unknow
n-pragmas -O3 -DNDEBUG -fPIC -MD -MT CMakeFiles/ghost.dir/src/carp.
c.o -MF CMakeFiles/ghost.dir/src/carp.c.o.d -o CMakeFiles/ghost.dir
/src/carp.c.o -c /data/rccs-sdt/a01008/tmpdir/spack-stage/spack-sta
ge-ghost-develop-yrocrnlaw4prmghqzlv35qi5uv2rbzie/spack-src/src/car
p.c
773 [ 40%] Building C object CMakeFiles/ghost.dir/src/carp_rb.c.o
774 /vol0003/rccs-sdt/data/a01008/spack-all-test/env-20240227/spack/lib
/spack/env/fj/fcc -DIACA_MARKS_OFF -DMPICH_IGNORE_CXX_SEEK -DMPICH_
SKIP_MPICXX -D_FILE_OFFSET_BITS=64 -D_LARGEFILE64_SOURCE -Dghost_EX
PORTS -I/data/rccs-sdt/a01008/tmpdir/spack-stage/spack-stage-ghost-
develop-yrocrnlaw4prmghqzlv35qi5uv2rbzie/spack-src/include -I/vol00
03/rccs-sdt/data/a01008/tmpdir/spack-stage/spack-stage-ghost-develo
p-yrocrnlaw4prmghqzlv35qi5uv2rbzie/spack-build-yrocrnl -I/vol0003/r
ccs-sdt/data/a01008/tmpdir/spack-stage/spack-stage-ghost-develop-yr
ocrnlaw4prmghqzlv35qi5uv2rbzie/spack-build-yrocrnl/ghost -I/vol0003
/rccs-sdt/data/a01008/spack-all-test/env-20240227/spack/opt/spack/l
inux-rhel8-a64fx/fj-4.10.0/hwloc-1.11.13-fyw4zogmwdnv3n57fkqa7h4nbf
xjttsj/include -isystem /opt/FJSVxtclanga/.common/MECA029/include/m
pi/fujitsu -isystem /opt/FJSVxtclanga/tcsds-ssl2-latest/clang-comp/
include -fopenmp -fPIC -std=c99 -Wall -Wextra -pedantic -Wno-unknow
n-pragmas -O3 -DNDEBUG -fPIC -MD -MT CMakeFiles/ghost.dir/src/carp_
rb.c.o -MF CMakeFiles/ghost.dir/src/carp_rb.c.o.d -o CMakeFiles/gho
st.dir/src/carp_rb.c.o -c /data/rccs-sdt/a01008/tmpdir/spack-stage/
spack-stage-ghost-develop-yrocrnlaw4prmghqzlv35qi5uv2rbzie/spack-sr
c/src/carp_rb.c
>> 775 /data/rccs-sdt/a01008/tmpdir/spack-stage/spack-stage-ghost-develop-
yrocrnlaw4prmghqzlv35qi5uv2rbzie/spack-src/src/bench.c:9:10: fatal
error: 'immintrin.h' file not found
776 #include <immintrin.h>
777 ^~~~~~~~~~~~~
778 1 error generated.
>> 779 make[2]: *** [CMakeFiles/ghost.dir/build.make:1311: CMakeFiles/ghos
t.dir/src/bench.c.o] Error 1
780 make[2]: *** Waiting for unfinished jobs....
781 [ 40%] Building C object CMakeFiles/ghost.dir/src/compatibility_che
ck.c.o
782 /vol0003/rccs-sdt/data/a01008/spack-all-test/env-20240227/spack/lib
/spack/env/fj/fcc -DIACA_MARKS_OFF -DMPICH_IGNORE_CXX_SEEK -DMPICH_
SKIP_MPICXX -D_FILE_OFFSET_BITS=64 -D_LARGEFILE64_SOURCE -Dghost_EX
PORTS -I/data/rccs-sdt/a01008/tmpdir/spack-stage/spack-stage-ghost-
develop-yrocrnlaw4prmghqzlv35qi5uv2rbzie/spack-src/include -I/vol00
03/rccs-sdt/data/a01008/tmpdir/spack-stage/spack-stage-ghost-develo
p-yrocrnlaw4prmghqzlv35qi5uv2rbzie/spack-build-yrocrnl -I/vol0003/r
ccs-sdt/data/a01008/tmpdir/spack-stage/spack-stage-ghost-develop-yr
ocrnlaw4prmghqzlv35qi5uv2rbzie/spack-build-yrocrnl/ghost -I/vol0003
/rccs-sdt/data/a01008/spack-all-test/env-20240227/spack/opt/spack/l
inux-rhel8-a64fx/fj-4.10.0/hwloc-1.11.13-fyw4zogmwdnv3n57fkqa7h4nbf
xjttsj/include -isystem /opt/FJSVxtclanga/.common/MECA029/include/m
pi/fujitsu -isystem /opt/FJSVxtclanga/tcsds-ssl2-latest/clang-comp/
include -fopenmp -fPIC -std=c99 -Wall -Wextra -pedantic -Wno-unknow
n-pragmas -O3 -DNDEBUG -fPIC -MD -MT CMakeFiles/ghost.dir/src/compa
tibility_check.c.o -MF CMakeFiles/ghost.dir/src/compatibility_check
.c.o.d -o CMakeFiles/ghost.dir/src/compatibility_check.c.o -c /data
/rccs-sdt/a01008/tmpdir/spack-stage/spack-stage-ghost-develop-yrocr
nlaw4prmghqzlv35qi5uv2rbzie/spack-src/src/compatibility_check.c
783 make[2]: Leaving directory '/vol0003/rccs-sdt/data/a01008/tmpdir/sp
ack-stage/spack-stage-ghost-develop-yrocrnlaw4prmghqzlv35qi5uv2rbzi
e/spack-build-yrocrnl'
>> 784 make[1]: *** [CMakeFiles/Makefile2:138: CMakeFiles/ghost.dir/all] E
rror 2
785 make[1]: Leaving directory '/vol0003/rccs-sdt/data/a01008/tmpdir/sp
ack-stage/spack-stage-ghost-develop-yrocrnlaw4prmghqzlv35qi5uv2rbzi
e/spack-build-yrocrnl'
>> 786 make: *** [Makefile:149: all] Error 2
See build log for details:
/data/rccs-sdt/a01008/tmpdir/spack-stage/spack-stage-ghost-develop-yrocrnlaw4prmghqzlv35qi5uv2rbzie/spack-build-out.txt