List of Open Source Software which can be built on Fugaku

Spack logo
Spack will be used to manage open source software packages on Fugaku. Fugaku users can easily use pre-installed packages and built packages based on Spack recipes. The following list shows the results of building/compiling packages for aarch64 according to the Spack recipes. Note that the results in this list do not guarantee that each package will work properly. On the other hand, Fujitsu will provide the following packages compiled with Fujitsu compiler on Fugaku as "external" packages, of which Spack can be aware.
  • OpenJDK 11
  • Ruby 2.6.5 or later
  • Python2 2.7.15
  • Python3 3.6.8
  • Numpy 1.14.3
  • SciPy 1.0.0
  • Eclipse IDE 2019-09 R Packages
Please contact us from email:

ginac 1.7.11

Compiler Fujitsu Compiler Fujitsu C/C++ Compiler 4.10.0 tcsds-1.2.38
Result Dependency Error

Failed Reason

Failed to install dependency package :
------------------------------------------------
nter2_hashweak_rcpointer.o >/dev/null 2>&1
357 depbase=`echo base/output/cl_output_hex.lo | sed 's|[^/]*$|.deps/&|
;s|\.lo$||'`;\
358 /bin/sh ../libtool --tag=CXX --mode=compile /vol0003/rccs-sdt/da
ta/a01008/spack-all-test/env-20240227/spack/lib/spack/env/fj/case-i
nsensitive/FCC -std=gnu++11 -DHAVE_CONFIG_H -I. -I/data/rccs-sdt/a0
1008/tmpdir/spack-stage/spack-stage-cln-1.3.6-fgvriwyp7xqbmtpb3tbdt
qkk6qmhslic/spack-src/src -I../autoconf -I/data/rccs-sdt/a01008/tm
pdir/spack-stage/spack-stage-cln-1.3.6-fgvriwyp7xqbmtpb3tbdtqkk6qmh
slic/spack-src/include -I/data/rccs-sdt/a01008/tmpdir/spack-stage/s
pack-stage-cln-1.3.6-fgvriwyp7xqbmtpb3tbdtqkk6qmhslic/spack-src/src
-I../include -I../src -I/usr/include -g -O2 -MT base/output/cl_ou
tput_hex.lo -MD -MP -MF $depbase.Tpo -c -o base/output/cl_output_he
x.lo base/output/cl_output_hex.cc &&\
359 mv -f $depbase.Tpo $depbase.Plo
360 libtool: compile: /vol0003/rccs-sdt/data/a01008/spack-all-test/env
-20240227/spack/lib/spack/env/fj/case-insensitive/FCC -std=gnu++11
-DHAVE_CONFIG_H -I. -I/data/rccs-sdt/a01008/tmpdir/spack-stage/spac
k-stage-cln-1.3.6-fgvriwyp7xqbmtpb3tbdtqkk6qmhslic/spack-src/src -I
../autoconf -I/data/rccs-sdt/a01008/tmpdir/spack-stage/spack-stage-
cln-1.3.6-fgvriwyp7xqbmtpb3tbdtqkk6qmhslic/spack-src/include -I/dat
a/rccs-sdt/a01008/tmpdir/spack-stage/spack-stage-cln-1.3.6-fgvriwyp
7xqbmtpb3tbdtqkk6qmhslic/spack-src/src -I../include -I../src -I/usr
/include -g -O2 -MT base/hash/cl_rcpointer_hashweak_rcpointer.lo -M
D -MP -MF base/hash/.deps/cl_rcpointer_hashweak_rcpointer.Tpo -c ba
se/hash/cl_rcpointer_hashweak_rcpointer.cc -o base/hash/cl_rcpointe
r_hashweak_rcpointer.o >/dev/null 2>&1
>> 361 base/low/cl_low_div.cc:210:8: error: declaration of 'divu_64_rest'
in global scope conflicts with declaration with C language linkage
362 uint64 divu_64_rest;
363 ^
364 ./base/cl_low.h:987:21: note: declared with C language linkage here
365 extern "C" uint64 divu_64_rest; // -> Res
t r
366 ^
367 libtool: compile: /vol0003/rccs-sdt/data/a01008/spack-all-test/env
-20240227/spack/lib/spack/env/fj/case-insensitive/FCC -std=gnu++11
-DHAVE_CONFIG_H -I. -I/data/rccs-sdt/a01008/tmpdir/spack-stage/spac
k-stage-cln-1.3.6-fgvriwyp7xqbmtpb3tbdtqkk6qmhslic/spack-src/src -I
../autoconf -I/data/rccs-sdt/a01008/tmpdir/spack-stage/spack-stage-
cln-1.3.6-fgvriwyp7xqbmtpb3tbdtqkk6qmhslic/spack-src/include -I/dat
a/rccs-sdt/a01008/tmpdir/spack-stage/spack-stage-cln-1.3.6-fgvriwyp
7xqbmtpb3tbdtqkk6qmhslic/spack-src/src -I../include -I../src -I/usr
/include -g -O2 -MT base/input/cl_read_bad_syntax_exception.lo -MD
-MP -MF base/input/.deps/cl_read_bad_syntax_exception.Tpo -c base/i
nput/cl_read_bad_syntax_exception.cc -o base/input/cl_read_bad_synt
ax_exception.o >/dev/null 2>&1
368 1 error generated.
>> 369 make[1]: *** [Makefile:6430: base/low/cl_low_div.lo] Error 1
370 make[1]: *** Waiting for unfinished jobs....
371 libtool: compile: /vol0003/rccs-sdt/data/a01008/spack-all-test/env
-20240227/spack/lib/spack/env/fj/case-insensitive/FCC -std=gnu++11
-DHAVE_CONFIG_H -I. -I/data/rccs-sdt/a01008/tmpdir/spack-stage/spac
k-stage-cln-1.3.6-fgvriwyp7xqbmtpb3tbdtqkk6qmhslic/spack-src/src -I
../autoconf -I/data/rccs-sdt/a01008/tmpdir/spack-stage/spack-stage-
cln-1.3.6-fgvriwyp7xqbmtpb3tbdtqkk6qmhslic/spack-src/include -I/dat
a/rccs-sdt/a01008/tmpdir/spack-stage/spack-stage-cln-1.3.6-fgvriwyp
7xqbmtpb3tbdtqkk6qmhslic/spack-src/src -I../include -I../src -I/usr
/include -g -O2 -MT base/low/cl_low_isqrt.lo -MD -MP -MF base/low/.
deps/cl_low_isqrt.Tpo -c base/low/cl_low_isqrt.cc -o base/low/cl_lo
w_isqrt.o >/dev/null 2>&1
>> 372 base/low/cl_low_mul.cc:57:8: error: declaration of 'mulu64_high' in
global scope conflicts with declaration with C language linkage
373 uint64 mulu64_high;
374 ^
375 ./base/cl_low.h:354:21: note: declared with C language linkage here
376 extern "C" uint64 mulu64_high; // -> High-
Teil
377 ^
378 1 error generated.
379 libtool: compile: /vol0003/rccs-sdt/data/a01008/spack-all-test/env
-20240227/spack/lib/spack/env/fj/case-insensitive/FCC -std=gnu++11
-DHAVE_CONFIG_H -I. -I/data/rccs-sdt/a01008/tmpdir/spack-stage/spac
k-stage-cln-1.3.6-fgvriwyp7xqbmtpb3tbdtqkk6qmhslic/spack-src/src -I
../autoconf -I/data/rccs-sdt/a01008/tmpdir/spack-stage/spack-stage-
cln-1.3.6-fgvriwyp7xqbmtpb3tbdtqkk6qmhslic/spack-src/include -I/dat
a/rccs-sdt/a01008/tmpdir/spack-stage/spack-stage-cln-1.3.6-fgvriwyp
7xqbmtpb3tbdtqkk6qmhslic/spack-src/src -I../include -I../src -I/usr
/include -g -O2 -MT base/low/cl_low_isqrt2.lo -MD -MP -MF base/low/
.deps/cl_low_isqrt2.Tpo -c base/low/cl_low_isqrt2.cc -o base/low/cl
_low_isqrt2.o >/dev/null 2>&1
>> 380 make[1]: *** [Makefile:6430: base/low/cl_low_mul.lo] Error 1
381 libtool: compile: /vol0003/rccs-sdt/data/a01008/spack-all-test/env
-20240227/spack/lib/spack/env/fj/case-insensitive/FCC -std=gnu++11
-DHAVE_CONFIG_H -I. -I/data/rccs-sdt/a01008/tmpdir/spack-stage/spac
k-stage-cln-1.3.6-fgvriwyp7xqbmtpb3tbdtqkk6qmhslic/spack-src/src -I
../autoconf -I/data/rccs-sdt/a01008/tmpdir/spack-stage/spack-stage-
cln-1.3.6-fgvriwyp7xqbmtpb3tbdtqkk6qmhslic/spack-src/include -I/dat
a/rccs-sdt/a01008/tmpdir/spack-stage/spack-stage-cln-1.3.6-fgvriwyp
7xqbmtpb3tbdtqkk6qmhslic/spack-src/src -I../include -I../src -I/usr
/include -g -O2 -MT base/input/cl_read_eof_exception.lo -MD -MP -MF
base/input/.deps/cl_read_eof_exception.Tpo -c base/input/cl_read_e
of_exception.cc -o base/input/cl_read_eof_exception.o >/dev/null 2>
&1
382 libtool: compile: /vol0003/rccs-sdt/data/a01008/spack-all-test/env
-20240227/spack/lib/spack/env/fj/case-insensitive/FCC -std=gnu++11
-DHAVE_CONFIG_H -I. -I/data/rccs-sdt/a01008/tmpdir/spack-stage/spac
k-stage-cln-1.3.6-fgvriwyp7xqbmtpb3tbdtqkk6qmhslic/spack-src/src -I
../autoconf -I/data/rccs-sdt/a01008/tmpdir/spack-stage/spack-stage-
cln-1.3.6-fgvriwyp7xqbmtpb3tbdtqkk6qmhslic/spack-src/include -I/dat
a/rccs-sdt/a01008/tmpdir/spack-stage/spack-stage-cln-1.3.6-fgvriwyp
7xqbmtpb3tbdtqkk6qmhslic/spack-src/src -I../include -I../src -I/usr
/include -g -O2 -MT base/input/cl_read_junk_exception.lo -MD -MP -M
F base/input/.deps/cl_read_junk_exception.Tpo -c base/input/cl_read
_junk_exception.cc -o base/input/cl_read_junk_exception.o >/dev/nul
l 2>&1
383 libtool: compile: /vol0003/rccs-sdt/data/a01008/spack-all-test/env
-20240227/spack/lib/spack/env/fj/case-insensitive/FCC -std=gnu++11
-DHAVE_CONFIG_H -I. -I/data/rccs-sdt/a01008/tmpdir/spack-stage/spac
k-stage-cln-1.3.6-fgvriwyp7xqbmtpb3tbdtqkk6qmhslic/spack-src/src -I
../autoconf -I/data/rccs-sdt/a01008/tmpdir/spack-stage/spack-stage-
cln-1.3.6-fgvriwyp7xqbmtpb3tbdtqkk6qmhslic/spack-src/include -I/dat
a/rccs-sdt/a01008/tmpdir/spack-stage/spack-stage-cln-1.3.6-fgvriwyp
7xqbmtpb3tbdtqkk6qmhslic/spack-src/src -I../include -I../src -I/usr
/include -g -O2 -MT base/output/cl_output_hex.lo -MD -MP -MF base/o
utput/.deps/cl_output_hex.Tpo -c base/output/cl_output_hex.cc -fPI
C -DPIC -o base/output/.libs/cl_output_hex.o
384 libtool: compile: /vol0003/rccs-sdt/data/a01008/spack-all-test/env
-20240227/spack/lib/spack/env/fj/case-insensitive/FCC -std=gnu++11
-DHAVE_CONFIG_H -I. -I/data/rccs-sdt/a01008/tmpdir/spack-stage/spac
k-stage-cln-1.3.6-fgvriwyp7xqbmtpb3tbdtqkk6qmhslic/spack-src/src -I
../autoconf -I/data/rccs-sdt/a01008/tmpdir/spack-stage/spack-stage-
cln-1.3.6-fgvriwyp7xqbmtpb3tbdtqkk6qmhslic/spack-src/include -I/dat
a/rccs-sdt/a01008/tmpdir/spack-stage/spack-stage-cln-1.3.6-fgvriwyp
7xqbmtpb3tbdtqkk6qmhslic/spack-src/src -I../include -I../src -I/usr
/include -g -O2 -MT base/output/cl_output_dec.lo -MD -MP -MF base/o
utput/.deps/cl_output_dec.Tpo -c base/output/cl_output_dec.cc -o ba
se/output/cl_output_dec.o >/dev/null 2>&1
385 libtool: compile: /vol0003/rccs-sdt/data/a01008/spack-all-test/env
-20240227/spack/lib/spack/env/fj/case-insensitive/FCC -std=gnu++11
-DHAVE_CONFIG_H -I. -I/data/rccs-sdt/a01008/tmpdir/spack-stage/spac
k-stage-cln-1.3.6-fgvriwyp7xqbmtpb3tbdtqkk6qmhslic/spack-src/src -I
../autoconf -I/data/rccs-sdt/a01008/tmpdir/spack-stage/spack-stage-
cln-1.3.6-fgvriwyp7xqbmtpb3tbdtqkk6qmhslic/spack-src/include -I/dat
a/rccs-sdt/a01008/tmpdir/spack-stage/spack-stage-cln-1.3.6-fgvriwyp
7xqbmtpb3tbdtqkk6qmhslic/spack-src/src -I../include -I../src -I/usr
/include -g -O2 -MT base/output/cl_output_hex.lo -MD -MP -MF base/o
utput/.deps/cl_output_hex.Tpo -c base/output/cl_output_hex.cc -o ba
se/output/cl_output_hex.o >/dev/null 2>&1
386 make[1]: Leaving directory '/vol0003/rccs-sdt/data/a01008/tmpdir/sp
ack-stage/spack-stage-cln-1.3.6-fgvriwyp7xqbmtpb3tbdtqkk6qmhslic/sp
ack-src/src'
>> 387 make: *** [Makefile:675: all-recursive] Error 1

See build log for details:
/data/rccs-sdt/a01008/tmpdir/spack-stage/spack-stage-cln-1.3.6-fgvriwyp7xqbmtpb3tbdtqkk6qmhslic/spack-build-out.txt

==> Warning: Skipping build of ginac-1.7.11-ofxtyyklxb5gtbzkx4l5gyhgab4m3vxs since cln-1.3.6-fgvriwyp7xqbmtpb3tbdtqkk6qmhslic failed
==> Error: ginac-1.7.11-ofxtyyklxb5gtbzkx4l5gyhgab4m3vxs: Package was not installed
==> Error: Installation request failed. Refer to reported errors for failing package(s).


<= Back to list