List of Open Source Software which can be built on Fugaku

Spack logo
Spack will be used to manage open source software packages on Fugaku. Fugaku users can easily use pre-installed packages and built packages based on Spack recipes. The following list shows the results of building/compiling packages for aarch64 according to the Spack recipes. Note that the results in this list do not guarantee that each package will work properly. On the other hand, Fujitsu will provide the following packages compiled with Fujitsu compiler on Fugaku as "external" packages, of which Spack can be aware.
  • OpenJDK 11
  • Ruby 2.6.5 or later
  • Python2 2.7.15
  • Python3 3.6.8
  • Numpy 1.14.3
  • SciPy 1.0.0
  • Eclipse IDE 2019-09 R Packages
Please contact us from email:

globalarrays 5.8.2

Compiler Fujitsu Compiler Fujitsu C/C++ Compiler 4.10.0 tcsds-1.2.38
Result Dependency Error

Failed Reason

Failed to install dependency package :
------------------------------------------------
==> Warning: config:terminal_title has been replaced by install_status and is ignored
==> Warning: Failed to initialize repository: '$spack/var/spack/repos/local'.
No repo.yaml found in '$spack/var/spack/repos/local'
To remove the bad repository, run this command:
spack repo rm $spack/var/spack/repos/local
[+] /opt/FJSVxtclanga/tcsds-mpi-latest (external fujitsu-mpi-head-3njd5uwuazr4j2no6fqh4cpjmezknh3z)
[+] /opt/FJSVxtclanga/tcsds-ssl2-latest (external fujitsu-ssl2-head-7eif42hdxt2tixz7cufiyhj62kz3jntb)
[+] /usr (external gmake-4.2.1-eszqmok6vi6wxcmklx6bqloeidbh25kb)
[+] /vol0003/rccs-sdt/data/a01008/spack-all-test/env-20240227/spack/opt/spack/linux-rhel8-a64fx/fj-4.10.0/gnuconfig-2022-09-17-w33oejhx46ex2iql4orzjqdmt2kdqdb2
==> Installing globalarrays-5.8.2-fm6s47htpfaljakzrkykpmb3tmstxuwn [5/5]
==> No binary for globalarrays-5.8.2-fm6s47htpfaljakzrkykpmb3tmstxuwn found: installing from source
==> Fetching https://spack-llnl-mirror.s3-us-west-2.amazonaws.com/_source-cache/archive/51/51599e4abfe36f05cecfaffa33be19efbe9e9fa42d035fd3f866469b663c22a2.tar.gz
==> No patches needed for globalarrays
==> globalarrays: Executing phase: 'autoreconf'
==> globalarrays: Executing phase: 'configure'
==> globalarrays: Executing phase: 'build'
==> Error: ProcessError: Command exited with status 2:
'make' '-j16' 'V=1'

4 errors found in build log:
1962 /usr/bin/ld: /opt/FJSVxtclanga/tcsds-ssl2-latest/lib64/libscalapac
k.a(pbztrst1.o): relocation R_AARCH64_MOVW_UABS_G0_NC against `a l
ocal symbol' can not be used when making a shared object; recompil
e with -fPIC
1963 /usr/bin/ld: /opt/FJSVxtclanga/tcsds-ssl2-latest/lib64/libscalapac
k.a(pdlarf.o): relocation R_AARCH64_MOVW_UABS_G0_NC against `a loc
al symbol' can not be used when making a shared object; recompile
with -fPIC
1964 /usr/bin/ld: /opt/FJSVxtclanga/tcsds-ssl2-latest/lib64/libscalapac
k.a(pbdtrnv.o): relocation R_AARCH64_MOVW_UABS_G0_NC against `a lo
cal symbol' can not be used when making a shared object; recompile
with -fPIC
1965 /usr/bin/ld: /opt/FJSVxtclanga/tcsds-ssl2-latest/lib64/libscalapac
k.a(pbdvecadd.o): relocation R_AARCH64_MOVW_UABS_G0_NC against `a
local symbol' can not be used when making a shared object; recompi
le with -fPIC
1966 /usr/bin/ld: /opt/FJSVxtclanga/tcsds-ssl2-latest/lib64/libscalapac
k.a(pbdtrst1.o): relocation R_AARCH64_MOVW_UABS_G0_NC against `a l
ocal symbol' can not be used when making a shared object; recompil
e with -fPIC
1967 /usr/bin/ld: /opt/FJSVxtclanga/tcsds-ssl2-latest/lib64/libscalapac
k.a(blacs_map_.o)(.text+0x20c): unresolvable R_AARCH64_MOVW_UABS_G
0_NC relocation against symbol `ompi_mpi_comm_null'
>> 1968 /usr/bin/ld: final link failed: Nonrepresentable section on output
>> 1969 make[2]: *** [Makefile:4574: libga.la] Error 1
1970 make[2]: Leaving directory '/vol0003/rccs-sdt/data/a01008/tmpdir/s
pack-stage/spack-stage-globalarrays-5.8.2-fm6s47htpfaljakzrkykpmb3
tmstxuwn/spack-build'
>> 1971 make[1]: *** [Makefile:7349: all-recursive] Error 1
1972 make[1]: Leaving directory '/vol0003/rccs-sdt/data/a01008/tmpdir/s
pack-stage/spack-stage-globalarrays-5.8.2-fm6s47htpfaljakzrkykpmb3
tmstxuwn/spack-build'
>> 1973 make: *** [Makefile:4071: all] Error 2

See build log for details:
/data/rccs-sdt/a01008/tmpdir/spack-stage/spack-stage-globalarrays-5.8.2-fm6s47htpfaljakzrkykpmb3tmstxuwn/spack-build-out.txt


<= Back to list