List of Open Source Software which can be built on Fugaku

Spack logo
Spack will be used to manage open source software packages on Fugaku. Fugaku users can easily use pre-installed packages and built packages based on Spack recipes. The following list shows the results of building/compiling packages for aarch64 according to the Spack recipes. Note that the results in this list do not guarantee that each package will work properly. On the other hand, Fujitsu will provide the following packages compiled with Fujitsu compiler on Fugaku as "external" packages, of which Spack can be aware.
  • OpenJDK 11
  • Ruby 2.6.5 or later
  • Python2 2.7.15
  • Python3 3.6.8
  • Numpy 1.14.3
  • SciPy 1.0.0
  • Eclipse IDE 2019-09 R Packages
Please contact us from email:

gnupg 2.4.3

Compiler Fujitsu Compiler Fujitsu C/C++ Compiler 4.10.0 tcsds-1.2.38
Result Dependency Error

Failed Reason

Failed to install dependency package :
------------------------------------------------
==> Warning: config:terminal_title has been replaced by install_status and is ignored
==> Warning: Failed to initialize repository: '$spack/var/spack/repos/local'.
No repo.yaml found in '$spack/var/spack/repos/local'
To remove the bad repository, run this command:
spack repo rm $spack/var/spack/repos/local
[+] /usr (external gmake-4.2.1-eszqmok6vi6wxcmklx6bqloeidbh25kb)
[+] /vol0003/rccs-sdt/data/a01008/spack-all-test/env-20240227/spack/opt/spack/linux-rhel8-a64fx/fj-4.10.0/gnuconfig-2022-09-17-w33oejhx46ex2iql4orzjqdmt2kdqdb2
[+] /vol0003/rccs-sdt/data/a01008/spack-all-test/env-20240227/spack/opt/spack/linux-rhel8-a64fx/fj-4.10.0/libiconv-1.17-nh4rfr3f3pcowrx2xcn2l45yyfy3xzk6
==> Installing npth-1.6-rhwihhchpchxsfcw6ftbcq4icr32h6in [4/11]
==> No binary for npth-1.6-rhwihhchpchxsfcw6ftbcq4icr32h6in found: installing from source
==> Fetching https://spack-llnl-mirror.s3-us-west-2.amazonaws.com/_source-cache/archive/13/1393abd9adcf0762d34798dc34fdcf4d0d22a8410721e76f1e3afcd1daa4e2d1.tar.bz2
==> No patches needed for npth
==> npth: Executing phase: 'autoreconf'
==> npth: Executing phase: 'configure'
==> npth: Executing phase: 'build'
==> npth: Executing phase: 'install'
==> npth: Successfully installed npth-1.6-rhwihhchpchxsfcw6ftbcq4icr32h6in
Stage: 3.29s. Autoreconf: 0.88s. Configure: 1m 9.48s. Build: 5.53s. Install: 0.96s. Post-install: 0.98s. Total: 1m 21.98s
[+] /vol0003/rccs-sdt/data/a01008/spack-all-test/env-20240227/spack/opt/spack/linux-rhel8-a64fx/fj-4.10.0/npth-1.6-rhwihhchpchxsfcw6ftbcq4icr32h6in
[+] /vol0003/rccs-sdt/data/a01008/spack-all-test/env-20240227/spack/opt/spack/linux-rhel8-a64fx/fj-4.10.0/zlib-ng-2.1.4-m4nsqgrityww4eqljits3svzi4wynus3
[+] /vol0003/rccs-sdt/data/a01008/spack-all-test/env-20240227/spack/opt/spack/linux-rhel8-a64fx/fj-4.10.0/libgpg-error-1.47-bk6rwdkodbomfs556fio35g7o6lhnfw6
[+] /vol0003/rccs-sdt/data/a01008/spack-all-test/env-20240227/spack/opt/spack/linux-rhel8-a64fx/fj-4.10.0/libgcrypt-1.10.2-qkggbkzrxx5uqkfan7urfg7f2ha57e4e
==> Installing libassuan-2.5.6-3wficill2qton6p64cj7q2qjyjaqurnb [8/11]
==> No binary for libassuan-2.5.6-3wficill2qton6p64cj7q2qjyjaqurnb found: installing from source
==> Fetching https://spack-llnl-mirror.s3-us-west-2.amazonaws.com/_source-cache/archive/e9/e9fd27218d5394904e4e39788f9b1742711c3e6b41689a31aa3380bd5aa4f426.tar.bz2
==> No patches needed for libassuan
==> libassuan: Executing phase: 'autoreconf'
==> libassuan: Executing phase: 'configure'
==> libassuan: Executing phase: 'build'
==> libassuan: Executing phase: 'install'
==> libassuan: Successfully installed libassuan-2.5.6-3wficill2qton6p64cj7q2qjyjaqurnb
Stage: 5.73s. Autoreconf: 0.71s. Configure: 2m 37.37s. Build: 49.25s. Install: 2.42s. Post-install: 1.95s. Total: 4m 57.20s
[+] /vol0003/rccs-sdt/data/a01008/spack-all-test/env-20240227/spack/opt/spack/linux-rhel8-a64fx/fj-4.10.0/libassuan-2.5.6-3wficill2qton6p64cj7q2qjyjaqurnb
==> Installing libksba-1.6.4-a5t42dcdhge5o64pbn2mfjvflsimyxjo [9/11]
==> No binary for libksba-1.6.4-a5t42dcdhge5o64pbn2mfjvflsimyxjo found: installing from source
==> Fetching https://spack-llnl-mirror.s3-us-west-2.amazonaws.com/_source-cache/archive/bb/bbb43f032b9164d86c781ffe42213a83bf4f2fee91455edfa4654521b8b03b6b.tar.bz2
==> No patches needed for libksba
==> libksba: Executing phase: 'autoreconf'
==> libksba: Executing phase: 'configure'
==> libksba: Executing phase: 'build'
==> libksba: Executing phase: 'install'
==> libksba: Successfully installed libksba-1.6.4-a5t42dcdhge5o64pbn2mfjvflsimyxjo
Stage: 6.85s. Autoreconf: 0.99s. Configure: 2m 55.42s. Build: 2m 22.82s. Install: 2.55s. Post-install: 1.58s. Total: 5m 34.42s
[+] /vol0003/rccs-sdt/data/a01008/spack-all-test/env-20240227/spack/opt/spack/linux-rhel8-a64fx/fj-4.10.0/libksba-1.6.4-a5t42dcdhge5o64pbn2mfjvflsimyxjo
==> Installing pinentry-1.2.1-bienipujtzjwuwsl2bl43mthldhg433t [10/11]
==> No binary for pinentry-1.2.1-bienipujtzjwuwsl2bl43mthldhg433t found: installing from source
==> Fetching https://spack-llnl-mirror.s3-us-west-2.amazonaws.com/_source-cache/archive/45/457a185e5a85238fb945a955dc6352ab962dc8b48720b62fc9fa48c7540a4067.tar.bz2
==> No patches needed for pinentry
==> pinentry: Executing phase: 'autoreconf'
==> pinentry: Executing phase: 'configure'
==> pinentry: Executing phase: 'build'
==> pinentry: Executing phase: 'install'
==> pinentry: Successfully installed pinentry-1.2.1-bienipujtzjwuwsl2bl43mthldhg433t
Stage: 8.89s. Autoreconf: 0.96s. Configure: 2m 25.80s. Build: 7.49s. Install: 1.06s. Post-install: 1.47s. Total: 2m 49.49s
[+] /vol0003/rccs-sdt/data/a01008/spack-all-test/env-20240227/spack/opt/spack/linux-rhel8-a64fx/fj-4.10.0/pinentry-1.2.1-bienipujtzjwuwsl2bl43mthldhg433t
==> Installing gnupg-2.4.3-iihssvpvczwnz4wy74fg3e7h43jsajcr [11/11]
==> No binary for gnupg-2.4.3-iihssvpvczwnz4wy74fg3e7h43jsajcr found: installing from source
==> Fetching https://spack-llnl-mirror.s3-us-west-2.amazonaws.com/_source-cache/archive/a2/a271ae6d732f6f4d80c258ad9ee88dd9c94c8fdc33c3e45328c4d7c126bd219d.tar.bz2
==> No patches needed for gnupg
==> gnupg: Executing phase: 'autoreconf'
==> gnupg: Executing phase: 'configure'
==> gnupg: Executing phase: 'build'
==> Error: ProcessError: Command exited with status 2:
'make' '-j16' 'V=1'

5 errors found in build log:
1680 /vol0003/rccs-sdt/data/a01008/tmpdir/spack-stage/spack-stage-gnupg
-2.4.3-iihssvpvczwnz4wy74fg3e7h43jsajcr/spack-src/build-aux/missin
g: line 81: makeinfo: command not found
1681 incd="`test -f defsincdate || echo '/data/rccs-sdt/a01008/tmpdir/s
pack-stage/spack-stage-gnupg-2.4.3-iihssvpvczwnz4wy74fg3e7h43jsajc
r/spack-src/doc/'`defsincdate"; \
1682 for file in gnupg7.texi gpg.texi gpgsm.texi gpg-agent.texi dirmngr
.texi scdaemon.texi tools.texi wks.texi gpg-card.texi ; do \
1683 /vol0003/rccs-sdt/data/a01008/spack-all-test/env-202
40227/spack/opt/spack/linux-rhel8-a64fx/fj-4.10.0/libgpg-error-1.4
7-bk6rwdkodbomfs556fio35g7o6lhnfw6/bin/yat2m -I /data/rccs-sdt/a01
008/tmpdir/spack-stage/spack-stage-gnupg-2.4.3-iihssvpvczwnz4wy74f
g3e7h43jsajcr/spack-src/doc --release "GnuPG 2.4.3" --source "GNU
Privacy Guard 2.4" --store \
1684 --date "`cat $incd 2>/dev/null`" \
1685 `test -f '$file' || echo '/data/rccs-sdt/a01008/tmpdir/s
pack-stage/spack-stage-gnupg-2.4.3-iihssvpvczwnz4wy74fg3e7h43jsajc
r/spack-src/doc/'`$file ; done
>> 1686 WARNING: 'makeinfo' is missing on your system.
1687 You should only need it if you modified a '.texi' file, o
r
1688 any other file indirectly affecting the aspect of the man
ual.
1689 You might want to install the Texinfo package:
1690 <http://www.gnu.org/software/texinfo/>
1691 The spurious makeinfo call might also be the consequence
of
1692 using a buggy 'make' (AIX, DU, IRIX), in which case you m
ight
1693 want to install GNU make:
1694 <http://www.gnu.org/software/make/>
>> 1695 make[3]: *** [Makefile:574: /data/rccs-sdt/a01008/tmpdir/spack-sta
ge/spack-stage-gnupg-2.4.3-iihssvpvczwnz4wy74fg3e7h43jsajcr/spack-
src/doc/gnupg.info] Error 127
1696 make[3]: *** Waiting for unfinished jobs....
1697 make[3]: Leaving directory '/vol0003/rccs-sdt/data/a01008/tmpdir/s
pack-stage/spack-stage-gnupg-2.4.3-iihssvpvczwnz4wy74fg3e7h43jsajc
r/spack-src/doc'
>> 1698 make[2]: *** [Makefile:538: all] Error 2
1699 make[2]: Leaving directory '/vol0003/rccs-sdt/data/a01008/tmpdir/s
pack-stage/spack-stage-gnupg-2.4.3-iihssvpvczwnz4wy74fg3e7h43jsajc
r/spack-src/doc'
>> 1700 make[1]: *** [Makefile:632: all-recursive] Error 1
1701 make[1]: Leaving directory '/vol0003/rccs-sdt/data/a01008/tmpdir/s
pack-stage/spack-stage-gnupg-2.4.3-iihssvpvczwnz4wy74fg3e7h43jsajc
r/spack-src'
>> 1702 make: *** [Makefile:552: all] Error 2

See build log for details:
/data/rccs-sdt/a01008/tmpdir/spack-stage/spack-stage-gnupg-2.4.3-iihssvpvczwnz4wy74fg3e7h43jsajcr/spack-build-out.txt


<= Back to list